﻿"Item Id","Item URI","Dublin Core:Identifier","Dublin Core:Title","Dublin Core:Alternative Title","Dublin Core:Description","Dublin Core:Creator","Dublin Core:Publisher","Dublin Core:Date","Dublin Core:Temporal Coverage","Dublin Core:Coverage","Dublin Core:Spatial Coverage","Dublin Core:Subject","Dublin Core:Type","Dublin Core:Format","Dublin Core:Source","Dublin Core:Is Part Of","Dublin Core:Has Format","Dublin Core:Provenance","Dublin Core:Language","Dublin Core:Rights","Dublin Core:Relation","Dublin Core:Contributor","Dublin Core:Abstract","Dublin Core:Table Of Contents","Dublin Core:Date Available","Dublin Core:Date Created","Dublin Core:Date Accepted","Dublin Core:Date Copyrighted","Dublin Core:Date Submitted","Dublin Core:Date Issued","Dublin Core:Date Modified","Dublin Core:Date Valid","Dublin Core:Access Rights","Dublin Core:License","Dublin Core:Conforms To","Dublin Core:Has Part","Dublin Core:Has Version","Dublin Core:Is Format Of","Dublin Core:Is Referenced By","Dublin Core:Is Replaced By","Dublin Core:Is Required By","Dublin Core:Is Version Of","Dublin Core:References","Dublin Core:Replaces","Dublin Core:Requires","Dublin Core:Extent","Dublin Core:Medium","Dublin Core:Bibliographic Citation","Dublin Core:Accrual Method","Dublin Core:Accrual Periodicity","Dublin Core:Accrual Policy","Dublin Core:Audience","Dublin Core:Audience Education Level","Dublin Core:Mediator","Dublin Core:Instructional Method","Dublin Core:Rights Holder","Item Type Metadata:Text","Item Type Metadata:Interviewer","Item Type Metadata:Interviewee","Item Type Metadata:Location","Item Type Metadata:Transcription","Item Type Metadata:Local URL","Item Type Metadata:Original Format","Item Type Metadata:Physical Dimensions","Item Type Metadata:Duration","Item Type Metadata:Compression","Item Type Metadata:Producer","Item Type Metadata:Director","Item Type Metadata:Bit Rate/Frequency","Item Type Metadata:Time Summary","Item Type Metadata:Email Body","Item Type Metadata:Subject Line","Item Type Metadata:From","Item Type Metadata:To","Item Type Metadata:CC","Item Type Metadata:BCC","Item Type Metadata:Number of Attachments","Item Type Metadata:Standards","Item Type Metadata:Objectives","Item Type Metadata:Materials","Item Type Metadata:Lesson Plan Text","Item Type Metadata:URL","Item Type Metadata:Event Type","Item Type Metadata:Participants","Item Type Metadata:Birth Date","Item Type Metadata:Birthplace","Item Type Metadata:Death Date","Item Type Metadata:Occupation","Item Type Metadata:Biographical Text","Item Type Metadata:Bibliography","Item Type Metadata:Player","Item Type Metadata:Imported Thumbnail","Item Type Metadata:OHMS Object","Item Type Metadata:OHMS Object Text","Item Type Metadata:Interview Keyword","Item Type Metadata:Sort Priority","PDF Text:Text",Scripto:Transcription,tags,file,itemType,collection,public,featured
4269,http://libarchstor2.uah.edu/digitalcollections/items/show/4269,spc_nick_000541_000541,"Letter to Robert K. Bell and his wife, Carolyn, from Ray H. Jenkins.",,"This letter addressed to both Robert and his wife details personal correspondence about various daily activities of Jenkins' life.","Jenkins, Ray H.",,1957-07-18,1950-1959,,,"Courts-martial and courts of inquiry--United States^^Defense information, Classified^^Intermediate-range ballistic missiles^^Jupiter missile^^Leaks (Disclosure of information)^^Huntsville (Ala.)^^Madison County (Ala.)",Correspondence^^Text,,"Col. John C. Nickerson, Jr. Papers^^Box 1, Series 3, Folder 16^^University of Alabama in Huntsville Archives, Special Collections, and Digital Initiatives, Huntsville, Alabama",,,,en,"This material may be protected under U. S. Copyright Law (Title 17, U.S. Code) which governs the making of photocopies or reproductions of copyrighted materials. You may use the digitized material for private study, scholarship, or research. Though the University of Alabama in Huntsville Archives and Special Collections has physical ownership of the material in its collections, in some cases we may not own the copyright to the material. It is the patron's obligation to determine and satisfy copyright restrictions when publishing or otherwise distributing materials found in our collections.",spc_nick_2021_03,,,,,,,,,,,,,,,,,,,,,,,,,,,,,,,,,,,,,,,,,,,,,,,,,,,,,,,,,,,,,,,,,,,,,,,,,,,,,,,http://libarchstor2.uah.edu/digitalcollections/files/original/4/4269/spc_nick_000541_000541.pdf,,"Col. John C. Nickerson, Jr. Papers",1,0
4272,http://libarchstor2.uah.edu/digitalcollections/items/show/4272,spc_nick_000546_000547,"Letter to Lt. Col. Charles R. Zimmer from Ray H. Jenkins.",,"Jenkins writes in reponse to Zimmer's letter of September 27, 1957 about Zimmer's upcoming visit to Knoxville for the Georgia Tech game. Jenkins writes that Bell has also accepted the invitation and will be there as well. This copy of the letter includes a message for Robert K. Bell as it was forwarded to him as well. Jenkins writes about a mutual friend, Kenneth Nugent, who called after the game. Jenkins tells Bell to thank Kenneth for the call and that he is sorry to have missed him.","Jenkins, Ray H.",,1957-09-30,1950-1959,,,"Courts-martial and courts of inquiry--United States^^Defense information, Classified^^Intermediate-range ballistic missiles^^Letter writing^^Leaks (Disclosure of information)^^Calhoun County (Ala.)^^Knoxville (Tenn.)",Correspondence^^Text,,"Col. John C. Nickerson, Jr. Papers^^Box 1, Series 3, Folder 16^^University of Alabama in Huntsville Archives, Special Collections, and Digital Initiatives, Huntsville, Alabama",,,,en,"This material may be protected under U. S. Copyright Law (Title 17, U.S. Code) which governs the making of photocopies or reproductions of copyrighted materials. You may use the digitized material for private study, scholarship, or research. Though the University of Alabama in Huntsville Archives and Special Collections has physical ownership of the material in its collections, in some cases we may not own the copyright to the material. It is the patron's obligation to determine and satisfy copyright restrictions when publishing or otherwise distributing materials found in our collections.",spc_nick_2021_03,,,,,,,,,,,,,,,,,,,,,,,,,,,,,,,,,,,,,,,,,,,,,,,,,,,,,,,,,,,,,,,,,,,,,,,,,,,,,,,http://libarchstor2.uah.edu/digitalcollections/files/original/4/4272/spc_nick_000546_000547.pdf,,"Col. John C. Nickerson, Jr. Papers",1,0
4275,http://libarchstor2.uah.edu/digitalcollections/items/show/4275,spc_nick_000554_000555,"Letter to Robert K. Bell from Ray H. Jenkins.",,"Jenkins writes to Bell in response to a previous letter. They frequently exchange humorous stories through correspondence and Jenkins states that he will tell another when they meet in person again. Jenkins also expresses longing to get together with the entire defense counsel and their families and looks forward to doing so.","Jenkins, Ray H.",,1957-04-09,1950-1959,,,"Courts-martial and courts of inquiry--United States^^Defense information, Classified^^Intermediate-range ballistic missiles^^Letter writing^^Leaks (Disclosure of information)^^Madison County (Ala.)^^Knoxville (Tenn.)",Correspondence^^Text,,"Col. John C. Nickerson, Jr. Papers^^Box 1, Series 3, Folder 16^^University of Alabama in Huntsville Archives, Special Collections, and Digital Initiatives, Huntsville, Alabama",,,,en,"This material may be protected under U. S. Copyright Law (Title 17, U.S. Code) which governs the making of photocopies or reproductions of copyrighted materials. You may use the digitized material for private study, scholarship, or research. Though the University of Alabama in Huntsville Archives and Special Collections has physical ownership of the material in its collections, in some cases we may not own the copyright to the material. It is the patron's obligation to determine and satisfy copyright restrictions when publishing or otherwise distributing materials found in our collections.",spc_nick_2021_03,,,,,,,,,,,,,,,,,,,,,,,,,,,,,,,,,,,,,,,,,,,,,,,,,,,,,,,,,,,,,,,,,,,,,,,,,,,,,,,http://libarchstor2.uah.edu/digitalcollections/files/original/4/4275/spc_nick_000554_000555.pdf,,"Col. John C. Nickerson, Jr. Papers",1,0
4278,http://libarchstor2.uah.edu/digitalcollections/items/show/4278,spc_nick_000561_000561,"Letter to Robert K. Bell from Ray H. Jenkins.",,"Jenkins writes to Bell about Drew Pearson's book, U.S.A.--Second-Class Power?, of which, he mentions, has an entire chapter on Colonel Nickerson.","Jenkins, Ray H.",,1958-12-29,1950-1959,,,"Courts-martial and courts of inquiry--United States^^Defense information, Classified^^Intermediate-range ballistic missiles^^Letter writing^^Leaks (Disclosure of information)^^Madison County (Ala.)^^Knoxville (Tenn.)",Correspondence^^Text,,"Col. John C. Nickerson, Jr. Papers^^Box 1, Series 3, Folder 16^^University of Alabama in Huntsville Archives, Special Collections, and Digital Initiatives, Huntsville, Alabama",,,,en,"This material may be protected under U. S. Copyright Law (Title 17, U.S. Code) which governs the making of photocopies or reproductions of copyrighted materials. You may use the digitized material for private study, scholarship, or research. Though the University of Alabama in Huntsville Archives and Special Collections has physical ownership of the material in its collections, in some cases we may not own the copyright to the material. It is the patron's obligation to determine and satisfy copyright restrictions when publishing or otherwise distributing materials found in our collections.",spc_nick_2021_03,,,,,,,,,,,,,,,,,,,,,,,,,,,,,,,,,,,,,,,,,,,,,,,,,,,,,,,,,,,,,,,,,,,,,,,,,,,,,,,http://libarchstor2.uah.edu/digitalcollections/files/original/4/4278/spc_nick_000561_000561.pdf,,"Col. John C. Nickerson, Jr. Papers",1,0
4314,http://libarchstor2.uah.edu/digitalcollections/items/show/4314,spc_nick_000647_000648,"Letter to Lt. Col. Charles R. Zimmer from Ray H. Jenkins.",,"Jenkins writes to invite Zimmer to the Tennessee-Georgia Tech game in Knoxville along with Robert K. Bell and his wife.","Jenkins, Ray H.",,1957-08-12,1950-1959,,,"Courts-martial and courts of inquiry--United States^^Defense information, Classified^^Intermediate-range ballistic missiles^^Jupiter missile^^Leaks (Disclosure of information)^^Huntsville (Ala.)^^Madison County (Ala.)",Correspondence^^Text,,"Col. John C. Nickerson, Jr. Papers^^Box 2, Series 5, Folder 9^^University of Alabama in Huntsville Archives, Special Collections, and Digital Initiatives, Huntsville, Alabama",,,,en,"This material may be protected under U. S. Copyright Law (Title 17, U.S. Code) which governs the making of photocopies or reproductions of copyrighted materials. You may use the digitized material for private study, scholarship, or research. Though the University of Alabama in Huntsville Archives and Special Collections has physical ownership of the material in its collections, in some cases we may not own the copyright to the material. It is the patron's obligation to determine and satisfy copyright restrictions when publishing or otherwise distributing materials found in our collections.",spc_nick_2021_03,,,,,,,,,,,,,,,,,,,,,,,,,,,,,,,,,,,,,,,,,,,,,,,,,,,,,,,,,,,,,,,,,,,,,,,,,,,,,,,http://libarchstor2.uah.edu/digitalcollections/files/original/4/4314/spc_nick_000647_000648.pdf,,"Col. John C. Nickerson, Jr. Papers",1,0
4315,http://libarchstor2.uah.edu/digitalcollections/items/show/4315,spc_nick_000649_000649,"Letter to John L. Greer, Harry Brown, Roy Brown, and T. G. Brown.",,"Jenkins writes to the Browns to inform them that Robert K. Bell and his wife will be in Knoxville for the Tennessee-Georgia Tech football game and states that they must come meet the Bells. Jenkins includes two paragraphs from a previous letter from Bell to demonstrate his personality.","Jenkins, Ray H.",,1957-08-24,1950-1959,,,"Courts-martial and courts of inquiry--United States^^Defense information, Classified^^Intermediate-range ballistic missiles^^Letter writing^^Knoxville (Tenn.)",Correspondence^^Text,,"Col. John C. Nickerson, Jr. Papers^^Box 2, Series 5, Folder 9^^University of Alabama in Huntsville Archives, Special Collections, and Digital Initiatives, Huntsville, Alabama",,,,en,"This material may be protected under U. S. Copyright Law (Title 17, U.S. Code) which governs the making of photocopies or reproductions of copyrighted materials. You may use the digitized material for private study, scholarship, or research. Though the University of Alabama in Huntsville Archives and Special Collections has physical ownership of the material in its collections, in some cases we may not own the copyright to the material. It is the patron's obligation to determine and satisfy copyright restrictions when publishing or otherwise distributing materials found in our collections.",spc_nick_2021_03,,,,,,,,,,,,,,,,,,,,,,,,,,,,,,,,,,,,,,,,,,,,,,,,,,,,,,,,,,,,,,,,,,,,,,,,,,,,,,,http://libarchstor2.uah.edu/digitalcollections/files/original/4/4315/spc_nick_000649_000649.pdf,,"Col. John C. Nickerson, Jr. Papers",1,0
6717,http://libarchstor2.uah.edu/digitalcollections/items/show/6717,spc_kram_000001_000083,"<i>Mariner IV Mission to Mars (Part I)</i>.","Technical Report No. 32-782","Reprinted from <i>Astronautics and Aeronautics</i>, June, July, and August 1965. The paper includes the note, ""These papers present the results of one phase of research carried out at the Jet Propulsion Laboratory, California Institute of Technology, under Contract No. NAS 7-100, sponsored by the National Aeronautics and Space Administration.""","Jet Propulsion Laboratory (U.S.)^^James, Jack N. (Jack Norval), 1920-2001)",,1965-09-15,1960-1969,,,"Flight paths^^Mariner 4 space probe^^Mars atmosphere^^Mars environment^^Mars missions^^Occultation^^Project management",Reports^^Text,,"Saunders Kramer Collection^^Box 59^^en^^University of Alabama in Huntsville Archives, Special Collections, and Digital Initiatives, Huntsville, Alabama",,,,en,"This material may be protected under U. S. Copyright Law (Title 17, U.S. Code) which governs the making of photocopies or reproductions of copyrighted materials. You may use the digitized material for private study, scholarship, or research. Though the University of Alabama in Huntsville Archives and Special Collections has physical ownership of the material in its collections, in some cases we may not own the copyright to the material. It is the patron's obligation to determine and satisfy copyright restrictions when publishing or otherwise distributing materials found in our collections.",spc_coll_2021_09_01,,,,,,,,,,,,,,,,,,,,,,,,,,,,,,,,,,,,,,,,,,,,,,,,,,,,,,,,,,,,,,,,,,,,,,,,,,,,,,,http://libarchstor2.uah.edu/digitalcollections/files/original/116/6717/spc_kram_000001_000083R.pdf,,"Saunders Kramer Collection",1,0
1176,http://libarchstor2.uah.edu/digitalcollections/items/show/1176,loc_jojr_000067_000070,"Program from the 2006 Yom Hashoah Holocaust Remembrance Service held at Temple B'nai Sholom in Huntsville, Alabama. ",,"The program includes a short biographical sketch of John Rison Jones. Jones lit the seventh candle during the service and received the 7th Candle Award, presented by Margaret Anne Goldsmith.","Jewish Federation of Huntsville and North Alabama",,2006-04-26,2000-2009,,,"Jones, John Rison^^Holocaust Remembrance Day^^Holocaust, Jewish--1939-1945^^Temple B'nai Sholom (Huntsville, Ala.)^^Huntsville (Ala.)^^Madison County (Ala.)",Programs^^Text,,"John Rison Jones, Jr. Collection^^Box 1^^University of Alabama in Huntsville Archives, Special Collections, and Digital Initiatives, Huntsville, Alabama",,,,en,"This material may be protected under U. S. Copyright Law (Title 17, U.S. Code) which governs the making of photocopies or reproductions of copyrighted materials. You may use the digitized material for private study, scholarship, or research. Though the University of Alabama in Huntsville Archives and Special Collections has physical ownership of the material in its collections, in some cases we may not own the copyright to the material. It is the patron's obligation to determine and satisfy copyright restrictions when publishing or otherwise distributing materials found in our collections.",loc_jojr_2019_11,,,,,,,,,,,,,,,,,,,,,,,,,,,,,,,,,,,,,,,,,,,,,,,,,,,,,,,,,,,,,,,,,,,,,,,,,,,,,,,http://libarchstor2.uah.edu/digitalcollections/files/original/68/1176/loc_jojr_000067_000070.pdf,,"John Rison Jones Collection",1,0
670,http://libarchstor2.uah.edu/digitalcollections/items/show/670,bradleyean_1927,"1927 Joe Bradley School <i>Bradleyean</i>.",,"The Joe Bradley School served children who lived in the Merrimack Mill village in Huntsville, Alabama. The yearbook includes photos of the mill and its officers.","Joe Bradley School (Huntsville, Ala.)",,1927,1920-1929,,,"Cotton manufacture^^Joe Bradley School (Huntsville, Ala.)^^Merrimack Mill (Huntsville, Ala.)^^School yearbooks^^Huntsville (Ala.)^^Madison County (Ala.)","Yearbooks^^Still Image^^Text",,"Books and Monographs^^University of Alabama in Huntsville Archives, Special Collections, and Digital Initiatives, Huntsville, Alabama",,,,en,"This material may be protected under U. S. Copyright Law (Title 17, U.S. Code) which governs the making of photocopies or reproductions of copyrighted materials. You may use the digitized material for private study, scholarship, or research. Though the University of Alabama in Huntsville Archives and Special Collections has physical ownership of the material in its collections, in some cases we may not own the copyright to the material. It is the patron's obligation to determine and satisfy copyright restrictions when publishing or otherwise distributing materials found in our collections.",,,,,,,,,,,,,,,,,,,,,,,,,,,,,,,,,,,,,,,,,,,,,,,,,,,,,,,,,,,,,,,,,,,,,,,,,,,,,,,,http://libarchstor2.uah.edu/digitalcollections/files/original/16/670/loc_merr_001_138.pdf,,"Books and Monographs",1,0
1145,http://libarchstor2.uah.edu/digitalcollections/items/show/1145,spc_stnv_000061,"""America's Spaceport.""",KSC-601,"Guide to John F. Kennedy Space Center, including an introduction from Center director Kurt Debus.","John F. Kennedy Space Center^^United States. National Aeronautics and Space Administration",,1967-09-01,1960-1969,,,"Saturn Project (U.S.)^^John F. Kennedy Space Center^^Launch complexes (Astronautics)^^United States. National Aeronautics and Space Administration^^Astronautics--United States^^Outer space--Exploration^^Aeronautics--United States",Pamphlets^^Text,,"Saturn V Collection^^Box 36, Folder 103^^University of Alabama in Huntsville Archives, Special Collections, and Digital Initiatives, Huntsville, Alabama",,,,en,"This material may be protected under U. S. Copyright Law (Title 17, U.S. Code) which governs the making of photocopies or reproductions of copyrighted materials. You may use the digitized material for private study, scholarship, or research. Though the University of Alabama in Huntsville Archives and Special Collections has physical ownership of the material in its collections, in some cases we may not own the copyright to the material. It is the patron's obligation to determine and satisfy copyright restrictions when publishing or otherwise distributing materials found in our collections.",spc_stnv_000051_000074,,,,,,,,,,,,,,,,,,,,,,,,,,,,,,,,,,,,,,,,,,,,,,,,,,,,,,,,,,,,,,,,,,,,,,,,,,,,,,,http://libarchstor2.uah.edu/digitalcollections/files/original/20/1145/spc_stnv_000061.pdf,,"Saturn V Collection",1,0
1664,http://libarchstor2.uah.edu/digitalcollections/items/show/1664,spc_stnv_000191A,"Catalog of launch vehicle tests Saturn V : Apollo/Saturn 502 : Volume 1, Section 1.","GP-267^^X67-10694^^NASA TMX 59133","The document is Volume 1, Section 1 of a list of Saturn V launch tests including but not limited to test titles, test numbers, test objectives, and test descriptions related to AS-502.","John F. Kennedy Space Center",,1966-08-01,1960-1969,,,"Saturn Project (U.S.)^^Project Apollo (U.S.)^^Saturn launch vehicles--Testing^^Saturn 5 launch vehicles^^ Apollo spacecraft^^Tests",,,"Saturn V Collection^^Box 18, Folder 13-14^^University of Alabama in Huntsville Archives, Special Collections, and Digital Initiatives, Huntsville, Alabama",,,,en,"This material may be protected under U. S. Copyright Law (Title 17, U.S. Code) which governs the making of photocopies or reproductions of copyrighted materials. You may use the digitized material for private study, scholarship, or research. Though the University of Alabama in Huntsville Archives and Special Collections has physical ownership of the material in its collections, in some cases we may not own the copyright to the material. It is the patron's obligation to determine and satisfy copyright restrictions when publishing or otherwise distributing materials found in our collections.",spc_stnv_000175_000199,,,,,,,,,,,,,,,,,,,,,,,,,,,,,,,,,,,,,,,,,,,,,,,,,,,,,,,,,,,,,http://libarchstor.uah.edu:8081/repositories/2/archival_objects/17508,,,,,,,,,,,,,,,,,,http://libarchstor2.uah.edu/digitalcollections/files/original/20/1664/spc_stnv_000191A.pdf,,"Saturn V Collection",1,0
6747,http://libarchstor2.uah.edu/digitalcollections/items/show/6747,spc_stnv_000191B,"Catalog of launch vehicle tests Saturn V : Apollo/Saturn 502 : Volume 1, Section 2.","GP-267^^X67-10694^^NASA TMX 59133","The document is Volume 1, Section 2 of a list of Saturn V launch tests including but not limited to test titles, test numbers, test objectives, and test descriptions related to AS-502.","John F. Kennedy Space Center",,1966-08-01,1960-1969,,,"Saturn Project (U.S.)^^Project Apollo (U.S.)^^Saturn launch vehicles--Testing^^Saturn 5 launch vehicles^^Apollo spacecraft^^Tests",Reports^^Text,,"Saturn V Collection^^Box 18, Folder 13-14^^University of Alabama in Huntsville Archives, Special Collections, and Digital Initiatives, Huntsville, Alabama",,,,en,"This material may be protected under U. S. Copyright Law (Title 17, U.S. Code) which governs the making of photocopies or reproductions of copyrighted materials. You may use the digitized material for private study, scholarship, or research. Though the University of Alabama in Huntsville Archives and Special Collections has physical ownership of the material in its collections, in some cases we may not own the copyright to the material. It is the patron's obligation to determine and satisfy copyright restrictions when publishing or otherwise distributing materials found in our collections.",spc_stnv_000191B_T,,,,,,,,,,,,,,,,,,,,,,,,,,,,,,,,,,,,,,,,,,,,,,,,,,,,,,,,,,,,,http://libarchstor.uah.edu:8081/repositories/2/archival_objects/17508,,,,,,,,,,,,,,,,,,http://libarchstor2.uah.edu/digitalcollections/files/original/20/6747/spc_stnv_000191B.pdf,,"Saturn V Collection",1,0