﻿"Item Id","Item URI","Dublin Core:Identifier","Dublin Core:Title","Dublin Core:Alternative Title","Dublin Core:Description","Dublin Core:Creator","Dublin Core:Publisher","Dublin Core:Date","Dublin Core:Temporal Coverage","Dublin Core:Coverage","Dublin Core:Spatial Coverage","Dublin Core:Subject","Dublin Core:Type","Dublin Core:Format","Dublin Core:Source","Dublin Core:Is Part Of","Dublin Core:Has Format","Dublin Core:Provenance","Dublin Core:Language","Dublin Core:Rights","Dublin Core:Relation","Dublin Core:Contributor","Dublin Core:Abstract","Dublin Core:Table Of Contents","Dublin Core:Date Available","Dublin Core:Date Created","Dublin Core:Date Accepted","Dublin Core:Date Copyrighted","Dublin Core:Date Submitted","Dublin Core:Date Issued","Dublin Core:Date Modified","Dublin Core:Date Valid","Dublin Core:Access Rights","Dublin Core:License","Dublin Core:Conforms To","Dublin Core:Has Part","Dublin Core:Has Version","Dublin Core:Is Format Of","Dublin Core:Is Referenced By","Dublin Core:Is Replaced By","Dublin Core:Is Required By","Dublin Core:Is Version Of","Dublin Core:References","Dublin Core:Replaces","Dublin Core:Requires","Dublin Core:Extent","Dublin Core:Medium","Dublin Core:Bibliographic Citation","Dublin Core:Accrual Method","Dublin Core:Accrual Periodicity","Dublin Core:Accrual Policy","Dublin Core:Audience","Dublin Core:Audience Education Level","Dublin Core:Mediator","Dublin Core:Instructional Method","Dublin Core:Rights Holder","Item Type Metadata:Text","Item Type Metadata:Interviewer","Item Type Metadata:Interviewee","Item Type Metadata:Location","Item Type Metadata:Transcription","Item Type Metadata:Local URL","Item Type Metadata:Original Format","Item Type Metadata:Physical Dimensions","Item Type Metadata:Duration","Item Type Metadata:Compression","Item Type Metadata:Producer","Item Type Metadata:Director","Item Type Metadata:Bit Rate/Frequency","Item Type Metadata:Time Summary","Item Type Metadata:Email Body","Item Type Metadata:Subject Line","Item Type Metadata:From","Item Type Metadata:To","Item Type Metadata:CC","Item Type Metadata:BCC","Item Type Metadata:Number of Attachments","Item Type Metadata:Standards","Item Type Metadata:Objectives","Item Type Metadata:Materials","Item Type Metadata:Lesson Plan Text","Item Type Metadata:URL","Item Type Metadata:Event Type","Item Type Metadata:Participants","Item Type Metadata:Birth Date","Item Type Metadata:Birthplace","Item Type Metadata:Death Date","Item Type Metadata:Occupation","Item Type Metadata:Biographical Text","Item Type Metadata:Bibliography","Item Type Metadata:Player","Item Type Metadata:Imported Thumbnail","Item Type Metadata:OHMS Object","Item Type Metadata:OHMS Object Text","Item Type Metadata:Interview Keyword","Item Type Metadata:Sort Priority","PDF Text:Text",Scripto:Transcription,tags,file,itemType,collection,public,featured
7034,http://libarchstor2.uah.edu/digitalcollections/items/show/7034,r01b03-01,"Legal and court documents, 1850",,,"Cabaniss, Septimus D.^^McClung, Margaret",,,,,,"Constables^^Blacksmithing^^Carriage industry^^Machining^^Cotton gins and ginning--United States--Costs","Election results^^Account books^^Correspondence",,"Series 1, Subseries B, Box 3, Folder 1",,,,en,"This material may be protected under U. S. Copyright Law (Title 17, U.S. Code) which governs the making of photocopies or reproductions of copyrighted materials. You may use the digitized material for private study, scholarship, or research. Though the University of Alabama in Huntsville Archives and Special Collections has physical ownership of the material in its collections, in some cases we may not own the copyright to the material. It is the patron's obligation to determine and satisfy copyright restrictions when publishing or otherwise distributing materials found in our collections.",r01b-210907,,,,,,,,,,,,,,,,,,,,,,,,,,,,,,,,,,,,,,,,,,,,,,,,,,,,,,,,,,,,,,,,,,,,,,,,,,,,,,,http://dkdayton.net/roberts/images/r01b/pdfs/r01b03-01.pdf,"Still Image","Series 01, Subseries B: Cabaniss Professional Business",1,0
7033,http://libarchstor2.uah.edu/digitalcollections/items/show/7033,r01b03-02,"Legal and court documents, 1851",,,"Cabaniss, S.D. ^^Spotswood, Sally D. ^^Fearn & Donegan Co. ",,,1850-1859,,,"Boardinghouses^^Grandparents^^Taverns^^Free African Americans^^Memphis and Charleston Railroad Company^^Huntsville (Ala.)^^Banks and banking","Travel voucher^^Legal documents^^Receipt",,"Series 1, Subseries B, Box 3, Folder 2",,,,en,"This material may be protected under U. S. Copyright Law (Title 17, U.S. Code) which governs the making of photocopies or reproductions of copyrighted materials. You may use the digitized material for private study, scholarship, or research. Though the University of Alabama in Huntsville Archives and Special Collections has physical ownership of the material in its collections, in some cases we may not own the copyright to the material. It is the patron's obligation to determine and satisfy copyright restrictions when publishing or otherwise distributing materials found in our collections.",r01b-210907,,,,,,,,,,,,,,,,,,,,,,,,,,,,,,,,,,,,,,,,,,,,,,,,,,,,,,,,,,,,,,,,,,,,,,,,,,,,,,,http://dkdayton.net/roberts/images/r01b/pdfs/r01b03-02.pdf,"Still Image","Series 01, Subseries B: Cabaniss Professional Business",1,0
7032,http://libarchstor2.uah.edu/digitalcollections/items/show/7032,r01b03-03a,"Legal and court documents, 1852 (1 of 3)",,,"Robinson, Mrs. C.P.",,,1850-1859,,,"Lumber^^Grocers^^Carriage industry^^Enslavement--medical care^^Southern Advocate (newspaper)^^Ornamental trees","Estate papers^^Will^^Receipts",,"Series 1, Subseries B, Box 3, Folder 3a",,,,en,"This material may be protected under U. S. Copyright Law (Title 17, U.S. Code) which governs the making of photocopies or reproductions of copyrighted materials. You may use the digitized material for private study, scholarship, or research. Though the University of Alabama in Huntsville Archives and Special Collections has physical ownership of the material in its collections, in some cases we may not own the copyright to the material. It is the patron's obligation to determine and satisfy copyright restrictions when publishing or otherwise distributing materials found in our collections.",r01b-210907,,,,,,,,,,,,,,,,,,,,,,,,,,,,,,,,,,,,,,,,,,,,,,,,,,,,,,,,,,,,,,,,,,,,,,,,,,,,,,,http://dkdayton.net/roberts/images/r01b/pdfs/r01b03-03a.pdf,"Still Image","Series 01, Subseries B: Cabaniss Professional Business",1,0
7031,http://libarchstor2.uah.edu/digitalcollections/items/show/7031,r01b03-03b,"Legal and court documents, 1852 (2 of 3)",,"Part 2 of folder 3.","Robinson, Mrs. C.P.^^Trotman & Nance",,,1850-1859,,,"Carriage industry^^Women's education^^Family life^^Stationery^^Latin language--Conversation and phrase books^^Grocers","Receipt^^Account book",,"Series 1, Subseries B, Box 3, Folder 3b",,,,en,"This material may be protected under U. S. Copyright Law (Title 17, U.S. Code) which governs the making of photocopies or reproductions of copyrighted materials. You may use the digitized material for private study, scholarship, or research. Though the University of Alabama in Huntsville Archives and Special Collections has physical ownership of the material in its collections, in some cases we may not own the copyright to the material. It is the patron's obligation to determine and satisfy copyright restrictions when publishing or otherwise distributing materials found in our collections.",r01b-210907,,,,,,,,,,,,,,,,,,,,,,,,,,,,,,,,,,,,,,,,,,,,,,,,,,,,,,,,,,,,,,,,,,,,,,,,,,,,,,,http://dkdayton.net/roberts/images/r01b/pdfs/r01b03-03b.pdf,"Still Image","Series 01, Subseries B: Cabaniss Professional Business",1,0
7030,http://libarchstor2.uah.edu/digitalcollections/items/show/7030,r01b03-04,"Legal and court documents, 1852 (3 of 3)",,,"Cabaniss, S.D.",,,1850-1859^^1860-1869,,,"Leather^^Credit^^Debt^^Memphis & Charleston Railroad Company^^Grocers","Receipt^^Account book^^Promissory note^^Business shares",,"Series 1, Subseries B, Box 3, Folder 4",,,,en,"This material may be protected under U. S. Copyright Law (Title 17, U.S. Code) which governs the making of photocopies or reproductions of copyrighted materials. You may use the digitized material for private study, scholarship, or research. Though the University of Alabama in Huntsville Archives and Special Collections has physical ownership of the material in its collections, in some cases we may not own the copyright to the material. It is the patron's obligation to determine and satisfy copyright restrictions when publishing or otherwise distributing materials found in our collections.",r01b-210907,,,,,,,,,,,,,,,,,,,,,,,,,,,,,,,,,,,,,,,,,,,,,,,,,,,,,,,,,,,,,,,,,,,,,,,,,,,,,,,http://dkdayton.net/roberts/images/r01b/pdfs/r01b03-04.pdf,"Still Image","Series 01, Subseries B: Cabaniss Professional Business",1,0
7029,http://libarchstor2.uah.edu/digitalcollections/items/show/7029,r01b03-05,"Legal and court documents, 1853",,,"Cavett, Moses",,,1850-1859,,,"Debt^^Banks and banking^^Travel^^Medical care^^Check cashing^^Blacksmithing","Estate^^Receipts^^Promissory notes",,"Series 1, Subseries B, Box 3, Folder 5",,,,en,"This material may be protected under U. S. Copyright Law (Title 17, U.S. Code) which governs the making of photocopies or reproductions of copyrighted materials. You may use the digitized material for private study, scholarship, or research. Though the University of Alabama in Huntsville Archives and Special Collections has physical ownership of the material in its collections, in some cases we may not own the copyright to the material. It is the patron's obligation to determine and satisfy copyright restrictions when publishing or otherwise distributing materials found in our collections.",r01b-210907,,,,,,,,,,,,,,,,,,,,,,,,,,,,,,,,,,,,,,,,,,,,,,,,,,,,,,,,,,,,,,,,,,,,,,,,,,,,,,,http://dkdayton.net/roberts/images/r01b/pdfs/r01b03-05.pdf,"Still Image","Series 01, Subseries B: Cabaniss Professional Business",1,0
7028,http://libarchstor2.uah.edu/digitalcollections/items/show/7028,r01b03-06,"Legal and court documents, 1854",,,"Spragins, Robert S. ^^Estate of George W. Drake",,,1850-1859,,,"Circuit courts^^Travel--19th century^^Business people^^Travel costs^^Jackson County (Ala.)^^Madison County (Ala.)","Receipts^^Estates^^Court documents",,"Series 1, Subseries B, Box 3, Folder 6",,,,en,"This material may be protected under U. S. Copyright Law (Title 17, U.S. Code) which governs the making of photocopies or reproductions of copyrighted materials. You may use the digitized material for private study, scholarship, or research. Though the University of Alabama in Huntsville Archives and Special Collections has physical ownership of the material in its collections, in some cases we may not own the copyright to the material. It is the patron's obligation to determine and satisfy copyright restrictions when publishing or otherwise distributing materials found in our collections.",r01b-210907,,,,,,,,,,,,,,,,,,,,,,,,,,,,,,,,,,,,,,,,,,,,,,,,,,,,,,,,,,,,,,,,,,,,,,,,,,,,,,,http://dkdayton.net/roberts/images/r01b/pdfs/r01b03-06.pdf,"Still Image","Series 01, Subseries B: Cabaniss Professional Business",1,0
7027,http://libarchstor2.uah.edu/digitalcollections/items/show/7027,r01b04-01,"Legal and court documents, 1855",,,"Cabaniss, Septimus D.^^Boggs, Sarah",,,1850-1859,,,"Grocers^^Toys^^Debt^^Madison County (Ala.)^^Mortgages","Receipts^^Court documents^^Correspondence",,"Series 1, Subseries B, Box 4, Folder 1",,,,en,"This material may be protected under U. S. Copyright Law (Title 17, U.S. Code) which governs the making of photocopies or reproductions of copyrighted materials. You may use the digitized material for private study, scholarship, or research. Though the University of Alabama in Huntsville Archives and Special Collections has physical ownership of the material in its collections, in some cases we may not own the copyright to the material. It is the patron's obligation to determine and satisfy copyright restrictions when publishing or otherwise distributing materials found in our collections.",r01b-210907,,,,,,,,,,,,,,,,,,,,,,,,,,,,,,,,,,,,,,,,,,,,,,,,,,,,,,,,,,,,,,,,,,,,,,,,,,,,,,,http://dkdayton.net/roberts/images/r01b/pdfs/r01b04-01.pdf,"Still Image","Series 01, Subseries B: Cabaniss Professional Business",1,0
7026,http://libarchstor2.uah.edu/digitalcollections/items/show/7026,r01b04-02,"Legal and court documents, 1856",,,,,,,,,,,,"Series 1, Subseries B, Box 4, Folder 2",,,,,,r01b-210907,,,,,,,,,,,,,,,,,,,,,,,,,,,,,,,,,,,,,,,,,,,,,,,,,,,,,,,,,,,,,,,,,,,,,,,,,,,,,,,http://dkdayton.net/roberts/images/r01b/pdfs/r01b04-02.pdf,"Still Image","Series 01, Subseries B: Cabaniss Professional Business",1,0
7025,http://libarchstor2.uah.edu/digitalcollections/items/show/7025,r01b04-03,"Legal and court documents, 1857",,,"Cabaniss, Septimus D.",,,1850-1859,,,"Grocers^^Textiles^^Tahlequah (Okla.)^^Franklin County (Ala.)^^Debt",Receipts^^Correspondence,,"Series 1, Subseries B, Box 4, Folder 3",,,,en,"This material may be protected under U. S. Copyright Law (Title 17, U.S. Code) which governs the making of photocopies or reproductions of copyrighted materials. You may use the digitized material for private study, scholarship, or research. Though the University of Alabama in Huntsville Archives and Special Collections has physical ownership of the material in its collections, in some cases we may not own the copyright to the material. It is the patron's obligation to determine and satisfy copyright restrictions when publishing or otherwise distributing materials found in our collections.",r01b-210907,,,,,,,,,,,,,,,,,,,,,,,,,,,,,,,,,,,,,,,,,,,,,,,,,,,,,,,,,,,,,,,,,,,,,,,,,,,,,,,http://dkdayton.net/roberts/images/r01b/pdfs/r01b04-03.pdf,"Still Image","Series 01, Subseries B: Cabaniss Professional Business",1,0
7024,http://libarchstor2.uah.edu/digitalcollections/items/show/7024,r01b04-04,"Legal and court documents, 1858 (1 of 2)",,,"Colcock, Charles J. ^^Coffey, John R. ",,,1850-1859,,,"Debt^^Fayetteville (Tenn.)^^Business people^^Fearn, Donegan, & Co. ^^Huntsville (Ala.)","Correspondence^^Promissory note",,"Series 1, Subseries B, Box 4, Folder 4",,,,en,"This material may be protected under U. S. Copyright Law (Title 17, U.S. Code) which governs the making of photocopies or reproductions of copyrighted materials. You may use the digitized material for private study, scholarship, or research. Though the University of Alabama in Huntsville Archives and Special Collections has physical ownership of the material in its collections, in some cases we may not own the copyright to the material. It is the patron's obligation to determine and satisfy copyright restrictions when publishing or otherwise distributing materials found in our collections.",r01b-210907,,,,,,,,,,,,,,,,,,,,,,,,,,,,,,,,,,,,,,,,,,,,,,,,,,,,,,,,,,,,,,,,,,,,,,,,,,,,,,,http://dkdayton.net/roberts/images/r01b/pdfs/r01b04-04.pdf,"Still Image","Series 01, Subseries B: Cabaniss Professional Business",1,0
7023,http://libarchstor2.uah.edu/digitalcollections/items/show/7023,r01b04-05,"Legal and court documents, 1858 (2 of 2)",,,"Cabaniss, Septimus D.^^Norris, George D.",,,1850-1859,,,"Lawrence County (Ala.)^^Cotton trade^^Addresses^^Memphis and Charleston Railroad Company^^Debt",Correspondence^^Receipt,,"Series 1, Subseries B, Box 4, Folder 5",,,,en,"This material may be protected under U. S. Copyright Law (Title 17, U.S. Code) which governs the making of photocopies or reproductions of copyrighted materials. You may use the digitized material for private study, scholarship, or research. Though the University of Alabama in Huntsville Archives and Special Collections has physical ownership of the material in its collections, in some cases we may not own the copyright to the material. It is the patron's obligation to determine and satisfy copyright restrictions when publishing or otherwise distributing materials found in our collections.",r01b-210907,,,,,,,,,,,,,,,,,,,,,,,,,,,,,,,,,,,,,,,,,,,,,,,,,,,,,,,,,,,,,,,,,,,,,,,,,,,,,,,http://dkdayton.net/roberts/images/r01b/pdfs/r01b04-05.pdf,"Still Image","Series 01, Subseries B: Cabaniss Professional Business",1,0
7022,http://libarchstor2.uah.edu/digitalcollections/items/show/7022,r01b04-06,"Legal and court documents, 1859 (1 of 3)",,,,,,,,,,,,"Series 1, Subseries B, Box 4, Folder 6",,,,,,r01b-210907,,,,,,,,,,,,,,,,,,,,,,,,,,,,,,,,,,,,,,,,,,,,,,,,,,,,,,,,,,,,,,,,,,,,,,,,,,,,,,,http://dkdayton.net/roberts/images/r01b/pdfs/r01b04-06.pdf,"Still Image","Series 01, Subseries B: Cabaniss Professional Business",1,0
7021,http://libarchstor2.uah.edu/digitalcollections/items/show/7021,r01b04-07,"Legal and court documents, 1859 (2 of 3) (Cotton Bale Sales)",,,,,,,,,,,,"Series 1, Subseries B, Box 4, Folder 7",,,,,,r01b-210907,,,,,,,,,,,,,,,,,,,,,,,,,,,,,,,,,,,,,,,,,,,,,,,,,,,,,,,,,,,,,,,,,,,,,,,,,,,,,,,http://dkdayton.net/roberts/images/r01b/pdfs/r01b04-07.pdf,"Still Image","Series 01, Subseries B: Cabaniss Professional Business",1,0
7020,http://libarchstor2.uah.edu/digitalcollections/items/show/7020,r01b04-08,"Legal and court documents, 1859 (3 of 3) (James F. Nimmo estate)",,,"Nimmo, James F.^^Coleman, John J.",,,1850-1859,,,"Stationery^^Corn as food^^Enslavement--Jackson County (Ala.)^^Travel--Texas^^Huntsville Female College (Huntsville, Ala.)^^Wheat","Estate^^Appraisal^^Promissory note",,"Series 1, Subseries B, Box 4, Folder 8",,,,en,"This material may be protected under U. S. Copyright Law (Title 17, U.S. Code) which governs the making of photocopies or reproductions of copyrighted materials. You may use the digitized material for private study, scholarship, or research. Though the University of Alabama in Huntsville Archives and Special Collections has physical ownership of the material in its collections, in some cases we may not own the copyright to the material. It is the patron's obligation to determine and satisfy copyright restrictions when publishing or otherwise distributing materials found in our collections.",r01b-210907,,,,,,,,,,,,,,,,,,,,,,,,,,,,,,,,,,,,,,,,,,,,,,,,,,,,,,,,,,,,,,,,,,,,,,,,,,,,,,,http://dkdayton.net/roberts/images/r01b/pdfs/r01b04-08.pdf,"Still Image","Series 01, Subseries B: Cabaniss Professional Business",1,0
7004,http://libarchstor2.uah.edu/digitalcollections/items/show/7004,r01b05-01,"Legal and court documents, 1860 (1 of 4)",,"Letter threatening blackmail?",,,,,,,,,,"Series 1, Subseries B, Box 5, Folder 1",,,,,,r01b-210907,,,,,,,,,,,,,,,,,,,,,,,,,,,,,,,,,,,,,,,,,,,,,,,,,,,,,,,,,,,,,,,,,,,,,,,,,,,,,,,http://dkdayton.net/roberts/images/r01b/pdfs/r01b05-01.pdf,"Still Image","Series 01, Subseries B: Cabaniss Professional Business",1,0
7003,http://libarchstor2.uah.edu/digitalcollections/items/show/7003,r01b05-02,"Legal and court documents, 1860 (2 of 4)",,,,,,,,,,,,"Series 1, Subseries B, Box 5, Folder 2",,,,,,r01b-210907,,,,,,,,,,,,,,,,,,,,,,,,,,,,,,,,,,,,,,,,,,,,,,,,,,,,,,,,,,,,,,,,,,,,,,,,,,,,,,,http://dkdayton.net/roberts/images/r01b/pdfs/r01b05-02.pdf,"Still Image","Series 01, Subseries B: Cabaniss Professional Business",1,0
7002,http://libarchstor2.uah.edu/digitalcollections/items/show/7002,r01b05-03,"Legal and court documents, 1860 (3 of 4)",,"Robinson estate",,,,,,,,,,"Series 1, Subseries B, Box 5, Folder 3",,,,,,r01b-210907,,,,,,,,,,,,,,,,,,,,,,,,,,,,,,,,,,,,,,,,,,,,,,,,,,,,,,,,,,,,,,,,,,,,,,,,,,,,,,,http://dkdayton.net/roberts/images/r01b/pdfs/r01b05-03.pdf,"Still Image","Series 01, Subseries B: Cabaniss Professional Business",1,0
7001,http://libarchstor2.uah.edu/digitalcollections/items/show/7001,r01b05-04,"Legal and court documents, 1860 (4 of 4)",,,,,,,,,,,,"Series 1, Subseries B, Box 5, Folder 4",,,,,,r01b-210907,,,,,,,,,,,,,,,,,,,,,,,,,,,,,,,,,,,,,,,,,,,,,,,,,,,,,,,,,,,,,,,,,,,,,,,,,,,,,,,http://dkdayton.net/roberts/images/r01b/pdfs/r01b05-04.pdf,"Still Image","Series 01, Subseries B: Cabaniss Professional Business",1,0
7000,http://libarchstor2.uah.edu/digitalcollections/items/show/7000,r01b05-05,"Legal and court documents, 1861",,,,,,,,,,,,"Series 1, Subseries B, Box 5, Folder 5",,,,,,r01b-210907,,,,,,,,,,,,,,,,,,,,,,,,,,,,,,,,,,,,,,,,,,,,,,,,,,,,,,,,,,,,,,,,,,,,,,,,,,,,,,,http://dkdayton.net/roberts/images/r01b/pdfs/r01b05-05.pdf,"Still Image","Series 01, Subseries B: Cabaniss Professional Business",1,0
6999,http://libarchstor2.uah.edu/digitalcollections/items/show/6999,r01b05-06,"Legal and court documents, 1862",,,,,,,,,,,,"Series 1, Subseries B, Box 5, Folder 6",,,,,,r01b-210907,,,,,,,,,,,,,,,,,,,,,,,,,,,,,,,,,,,,,,,,,,,,,,,,,,,,,,,,,,,,,,,,,,,,,,,,,,,,,,,http://dkdayton.net/roberts/images/r01b/pdfs/r01b05-06.pdf,"Still Image","Series 01, Subseries B: Cabaniss Professional Business",1,0
6998,http://libarchstor2.uah.edu/digitalcollections/items/show/6998,r01b05-07,"Legal and court documents, 1863",,,,,,,,,,,,"Series 1, Subseries B, Box 5, Folder 7",,,,,,r01b-210907,,,,,,,,,,,,,,,,,,,,,,,,,,,,,,,,,,,,,,,,,,,,,,,,,,,,,,,,,,,,,,,,,,,,,,,,,,,,,,,http://dkdayton.net/roberts/images/r01b/pdfs/r01b05-07.pdf,"Still Image","Series 01, Subseries B: Cabaniss Professional Business",1,0
6997,http://libarchstor2.uah.edu/digitalcollections/items/show/6997,r01b05-08,"Legal and court documents, 1864",,,,,,,,,,,,"Series 1, Subseries B, Box 5, Folder 8",,,,,,r01b-210907,,,,,,,,,,,,,,,,,,,,,,,,,,,,,,,,,,,,,,,,,,,,,,,,,,,,,,,,,,,,,,,,,,,,,,,,,,,,,,,http://dkdayton.net/roberts/images/r01b/pdfs/r01b05-08.pdf,"Still Image","Series 01, Subseries B: Cabaniss Professional Business",1,0
6996,http://libarchstor2.uah.edu/digitalcollections/items/show/6996,r01b05-09,"Legal and court documents, 1865",,,,,,,,,,,,"Series 1, Subseries B, Box 5, Folder 9",,,,,,r01b-210907,,,,,,,,,,,,,,,,,,,,,,,,,,,,,,,,,,,,,,,,,,,,,,,,,,,,,,,,,,,,,,,,,,,,,,,,,,,,,,,http://dkdayton.net/roberts/images/r01b/pdfs/r01b05-09.pdf,"Still Image","Series 01, Subseries B: Cabaniss Professional Business",1,0
6994,http://libarchstor2.uah.edu/digitalcollections/items/show/6994,r01b06-02,"Legal and court documents, 1866",,,,,,,,,,,,"Series 1, Subseries B, Box 6, Folder 2",,,,,,r01b-210907,,,,,,,,,,,,,,,,,,,,,,,,,,,,,,,,,,,,,,,,,,,,,,,,,,,,,,,,,,,,,,,,,,,,,,,,,,,,,,,http://dkdayton.net/roberts/images/r01b/pdfs/r01b06-02.pdf,"Still Image","Series 01, Subseries B: Cabaniss Professional Business",1,0
6993,http://libarchstor2.uah.edu/digitalcollections/items/show/6993,r01b06-03,"Legal and court documents, 1867",,,,,,,,,,,,"Series 1, Subseries B, Box 6, Folder 3",,,,,,r01b-210907,,,,,,,,,,,,,,,,,,,,,,,,,,,,,,,,,,,,,,,,,,,,,,,,,,,,,,,,,,,,,,,,,,,,,,,,,,,,,,,http://dkdayton.net/roberts/images/r01b/pdfs/r01b06-03.pdf,"Still Image","Series 01, Subseries B: Cabaniss Professional Business",1,0
6992,http://libarchstor2.uah.edu/digitalcollections/items/show/6992,r01b06-04,"Legal and court documents, 1868 (1 of 4) (Nick Davis Bankruptcy)",,,,,,,,,,,,"Series 1, Subseries B, Box 6, Folder 4",,,,,,r01b-210907,,,,,,,,,,,,,,,,,,,,,,,,,,,,,,,,,,,,,,,,,,,,,,,,,,,,,,,,,,,,,,,,,,,,,,,,,,,,,,,http://dkdayton.net/roberts/images/r01b/pdfs/r01b06-04.pdf,"Still Image","Series 01, Subseries B: Cabaniss Professional Business",1,0
6991,http://libarchstor2.uah.edu/digitalcollections/items/show/6991,r01b06-05,"Legal and court documents, 1868 (2 of 4)",,,,,,,,,,,,"Series 1, Subseries B, Box 6, Folder 5",,,,,,r01b-210907,,,,,,,,,,,,,,,,,,,,,,,,,,,,,,,,,,,,,,,,,,,,,,,,,,,,,,,,,,,,,,,,,,,,,,,,,,,,,,,http://dkdayton.net/roberts/images/r01b/pdfs/r01b06-05.pdf,"Still Image","Series 01, Subseries B: Cabaniss Professional Business",1,0
7050,http://libarchstor2.uah.edu/digitalcollections/items/show/7050,r01b06-06,"Legal and court documents, 1868 (3 of 4)",,,,,,,,,,,,"Series 1, Subseries B, Box 6, Folder 6",,,,,,r01b-210914,,,,,,,,,,,,,,,,,,,,,,,,,,,,,,,,,,,,,,,,,,,,,,,,,,,,,,,,,,,,,,,,,,,,,,,,,,,,,,,http://dkdayton.net/roberts/images/r01b/pdfs/r01b06-06.pdf,"Still Image","Series 01, Subseries B: Cabaniss Professional Business",1,0