﻿"Item Id","Item URI","Dublin Core:Identifier","Dublin Core:Title","Dublin Core:Alternative Title","Dublin Core:Description","Dublin Core:Creator","Dublin Core:Publisher","Dublin Core:Date","Dublin Core:Temporal Coverage","Dublin Core:Coverage","Dublin Core:Spatial Coverage","Dublin Core:Subject","Dublin Core:Type","Dublin Core:Format","Dublin Core:Source","Dublin Core:Is Part Of","Dublin Core:Has Format","Dublin Core:Provenance","Dublin Core:Language","Dublin Core:Rights","Dublin Core:Relation","Dublin Core:Contributor","Dublin Core:Abstract","Dublin Core:Table Of Contents","Dublin Core:Date Available","Dublin Core:Date Created","Dublin Core:Date Accepted","Dublin Core:Date Copyrighted","Dublin Core:Date Submitted","Dublin Core:Date Issued","Dublin Core:Date Modified","Dublin Core:Date Valid","Dublin Core:Access Rights","Dublin Core:License","Dublin Core:Conforms To","Dublin Core:Has Part","Dublin Core:Has Version","Dublin Core:Is Format Of","Dublin Core:Is Referenced By","Dublin Core:Is Replaced By","Dublin Core:Is Required By","Dublin Core:Is Version Of","Dublin Core:References","Dublin Core:Replaces","Dublin Core:Requires","Dublin Core:Extent","Dublin Core:Medium","Dublin Core:Bibliographic Citation","Dublin Core:Accrual Method","Dublin Core:Accrual Periodicity","Dublin Core:Accrual Policy","Dublin Core:Audience","Dublin Core:Audience Education Level","Dublin Core:Mediator","Dublin Core:Instructional Method","Dublin Core:Rights Holder","Item Type Metadata:Text","Item Type Metadata:Interviewer","Item Type Metadata:Interviewee","Item Type Metadata:Location","Item Type Metadata:Transcription","Item Type Metadata:Local URL","Item Type Metadata:Original Format","Item Type Metadata:Physical Dimensions","Item Type Metadata:Duration","Item Type Metadata:Compression","Item Type Metadata:Producer","Item Type Metadata:Director","Item Type Metadata:Bit Rate/Frequency","Item Type Metadata:Time Summary","Item Type Metadata:Email Body","Item Type Metadata:Subject Line","Item Type Metadata:From","Item Type Metadata:To","Item Type Metadata:CC","Item Type Metadata:BCC","Item Type Metadata:Number of Attachments","Item Type Metadata:Standards","Item Type Metadata:Objectives","Item Type Metadata:Materials","Item Type Metadata:Lesson Plan Text","Item Type Metadata:URL","Item Type Metadata:Event Type","Item Type Metadata:Participants","Item Type Metadata:Birth Date","Item Type Metadata:Birthplace","Item Type Metadata:Death Date","Item Type Metadata:Occupation","Item Type Metadata:Biographical Text","Item Type Metadata:Bibliography","Item Type Metadata:Player","Item Type Metadata:Imported Thumbnail","Item Type Metadata:OHMS Object","Item Type Metadata:OHMS Object Text","Item Type Metadata:Interview Keyword","Item Type Metadata:Sort Priority","PDF Text:Text",Scripto:Transcription,tags,file,itemType,collection,public,featured
1528,http://libarchstor2.uah.edu/digitalcollections/items/show/1528,spc_youn_000027_01^^spc_youn_000027_02^^MC_8_027,"Charlie Duke.",,,"Young, Anthony",,2003-03,2000-2009,,,,Interviews^^Audio,Audiocassettes,"Young Collection^^University of Alabama in Huntsville Archives, Special Collections, and Digital Initiatives, Huntsville, Alabama",,,,en,"This material may be protected under U. S. Copyright Law (Title 17, U.S. Code) which governs the making of photocopies or reproductions of copyrighted materials. You may use the digitized material for private study, scholarship, or research. Though the University of Alabama in Huntsville Archives and Special Collections has physical ownership of the material in its collections, in some cases we may not own the copyright to the material. It is the patron's obligation to determine and satisfy copyright restrictions when publishing or otherwise distributing materials found in our collections.",clir_grant_audio_metadata,,,,,,,,,,,,,,,,,,,,,,,,,,,,,,,,,,,,,,,,,,,,0:46:03,,,,,,,,,,,,,,,,,,,,,,,,,,,,,,,,,,"Oral History","http://libarchstor2.uah.edu/digitalcollections/files/original/73/1528/spc_youn_000027_01.mp3,http://libarchstor2.uah.edu/digitalcollections/files/original/73/1528/spc_youn_000027_02.mp3","Oral History","Anthony Young Collection",1,0
1527,http://libarchstor2.uah.edu/digitalcollections/items/show/1527,spc_youn_000026_01^^spc_youn_000026_02^^MC_8_026,"Eugene Cernan.",,,"Young, Anthony",,2003-05-13,2000-2009,,,,Interviews^^Audio,Audiocassettes,"Young Collection^^University of Alabama in Huntsville Archives, Special Collections, and Digital Initiatives, Huntsville, Alabama",,,,en,"This material may be protected under U. S. Copyright Law (Title 17, U.S. Code) which governs the making of photocopies or reproductions of copyrighted materials. You may use the digitized material for private study, scholarship, or research. Though the University of Alabama in Huntsville Archives and Special Collections has physical ownership of the material in its collections, in some cases we may not own the copyright to the material. It is the patron's obligation to determine and satisfy copyright restrictions when publishing or otherwise distributing materials found in our collections.",clir_grant_audio_metadata,,,,,,,,,,,,,,,,,,,,,,,,,,,,,,,,,,,,,,,,,,,,0:21:37,,,,,,,,,,,,,,,,,,,,,,,,,,,,,,,,,,"Oral History",http://libarchstor2.uah.edu/digitalcollections/files/original/73/1527/spc_youn_000026_01.mp3,"Oral History","Anthony Young Collection",1,0
1526,http://libarchstor2.uah.edu/digitalcollections/items/show/1526,spc_youn_000025_01^^spc_youn_000025_02^^MC_8_025,"John Young.",,,"Young, Anthony",,,,,,,Interviews^^Audio,Audiocassettes,"Young Collection^^University of Alabama in Huntsville Archives, Special Collections, and Digital Initiatives, Huntsville, Alabama",,,,en,"This material may be protected under U. S. Copyright Law (Title 17, U.S. Code) which governs the making of photocopies or reproductions of copyrighted materials. You may use the digitized material for private study, scholarship, or research. Though the University of Alabama in Huntsville Archives and Special Collections has physical ownership of the material in its collections, in some cases we may not own the copyright to the material. It is the patron's obligation to determine and satisfy copyright restrictions when publishing or otherwise distributing materials found in our collections.",clir_grant_audio_metadata,,,,,,,,,,,,,,,,,,,,,,,,,,,,,,,,,,,,,,,,,,,,0:27:57,,,,,,,,,,,,,,,,,,,,,,,,,,,,,,,,,,"Oral History","http://libarchstor2.uah.edu/digitalcollections/files/original/73/1526/spc_youn_000025_01.mp3,http://libarchstor2.uah.edu/digitalcollections/files/original/73/1526/spc_youn_000025_02.mp3","Oral History","Anthony Young Collection",1,0
1525,http://libarchstor2.uah.edu/digitalcollections/items/show/1525,spc_youn_000024_01^^spc_youn_000024_02^^MC_8_024,"Dave Scott.",,,"Young, Anthony",,2005-07-05,2000-2009,,,,Interviews^^Audio,Audiocassettes,"Young Collection^^University of Alabama in Huntsville Archives, Special Collections, and Digital Initiatives, Huntsville, Alabama",,,,en,"This material may be protected under U. S. Copyright Law (Title 17, U.S. Code) which governs the making of photocopies or reproductions of copyrighted materials. You may use the digitized material for private study, scholarship, or research. Though the University of Alabama in Huntsville Archives and Special Collections has physical ownership of the material in its collections, in some cases we may not own the copyright to the material. It is the patron's obligation to determine and satisfy copyright restrictions when publishing or otherwise distributing materials found in our collections.",clir_grant_audio_metadata,,,,,,,,,,,,,,,,,,,,,,,,,,,,,,,,,,,,,,,,,,,,0:28:00,,,,,,,,,,,,,,,,,,,,,,,,,,,,,,,,,,"Oral History",http://libarchstor2.uah.edu/digitalcollections/files/original/73/1525/spc_youn_000024_01.mp3,"Oral History","Anthony Young Collection",1,0
1524,http://libarchstor2.uah.edu/digitalcollections/items/show/1524,spc_youn_000023_01^^spc_youn_000023_02^^MC_8_023,"Ed Fendell.",,,"Young, Anthony",,2005-12-20,2000-2009,,,,Interviews^^Audio,Audiocassettes,"Young Collection^^University of Alabama in Huntsville Archives, Special Collections, and Digital Initiatives, Huntsville, Alabama",,,,en,"This material may be protected under U. S. Copyright Law (Title 17, U.S. Code) which governs the making of photocopies or reproductions of copyrighted materials. You may use the digitized material for private study, scholarship, or research. Though the University of Alabama in Huntsville Archives and Special Collections has physical ownership of the material in its collections, in some cases we may not own the copyright to the material. It is the patron's obligation to determine and satisfy copyright restrictions when publishing or otherwise distributing materials found in our collections.",clir_grant_audio_metadata,,,,,,,,,,,,,,,,,,,,,,,,,,,,,,,,,,,,,,,,,,,,0:53:46,,,,,,,,,,,,,,,,,,,,,,,,,,,,,,,,,,"Oral History","http://libarchstor2.uah.edu/digitalcollections/files/original/73/1524/spc_youn_000023_01.mp3,http://libarchstor2.uah.edu/digitalcollections/files/original/73/1524/spc_youn_000023_02.mp3","Oral History","Anthony Young Collection",1,0
1523,http://libarchstor2.uah.edu/digitalcollections/items/show/1523,spc_youn_000022_01^^spc_youn_000022_02^^MC_8_022,"Bill Muehlberger.",,,"Young, Anthony",,2005-12-14,2000-2009,,,,Interviews^^Audio,Audiocassettes,"Young Collection^^University of Alabama in Huntsville Archives, Special Collections, and Digital Initiatives, Huntsville, Alabama",,,,en,"This material may be protected under U. S. Copyright Law (Title 17, U.S. Code) which governs the making of photocopies or reproductions of copyrighted materials. You may use the digitized material for private study, scholarship, or research. Though the University of Alabama in Huntsville Archives and Special Collections has physical ownership of the material in its collections, in some cases we may not own the copyright to the material. It is the patron's obligation to determine and satisfy copyright restrictions when publishing or otherwise distributing materials found in our collections.",clir_grant_audio_metadata,,,,,,,,,,,,,,,,,,,,,,,,,,,,,,,,,,,,,,,,,,,,0:57:48,,,,,,,,,,,,,,,,,,,,,,,,,,,,,,,,,,"Oral History","http://libarchstor2.uah.edu/digitalcollections/files/original/73/1523/spc_youn_000022_01.mp3,http://libarchstor2.uah.edu/digitalcollections/files/original/73/1523/spc_youn_000022_02.mp3","Oral History","Anthony Young Collection",1,0
1522,http://libarchstor2.uah.edu/digitalcollections/items/show/1522,spc_youn_000021_01^^spc_youn_000021_02^^MC_8_021,"Otha Vaughan.",,,"Young, Anthony",,2005-03-20,2000-2009,,,,Interviews^^Audio,Audiocassettes,"Young Collection^^University of Alabama in Huntsville Archives, Special Collections, and Digital Initiatives, Huntsville, Alabama",,,,en,"This material may be protected under U. S. Copyright Law (Title 17, U.S. Code) which governs the making of photocopies or reproductions of copyrighted materials. You may use the digitized material for private study, scholarship, or research. Though the University of Alabama in Huntsville Archives and Special Collections has physical ownership of the material in its collections, in some cases we may not own the copyright to the material. It is the patron's obligation to determine and satisfy copyright restrictions when publishing or otherwise distributing materials found in our collections.",clir_grant_audio_metadata,,,,,,,,,,,,,,,,,,,,,,,,,,,,,,,,,,,,,,,,,,,,1:24:43,,,,,,,,,,,,,,,,,,,,,,,,,,,,,,,,,,"Oral History","http://libarchstor2.uah.edu/digitalcollections/files/original/73/1522/spc_youn_000021_01.mp3,http://libarchstor2.uah.edu/digitalcollections/files/original/73/1522/spc_youn_000021_02.mp3","Oral History","Anthony Young Collection",1,0
1521,http://libarchstor2.uah.edu/digitalcollections/items/show/1521,spc_youn_000020_01^^spc_youn_000020_02^^MC_8_020,"Ferenc Pavlics.",,,"Young, Anthony",,2005-08-30,2000-2009,,,,Interviews^^Audio,Audiocassettes,"Young Collection^^University of Alabama in Huntsville Archives, Special Collections, and Digital Initiatives, Huntsville, Alabama",,,,en,"This material may be protected under U. S. Copyright Law (Title 17, U.S. Code) which governs the making of photocopies or reproductions of copyrighted materials. You may use the digitized material for private study, scholarship, or research. Though the University of Alabama in Huntsville Archives and Special Collections has physical ownership of the material in its collections, in some cases we may not own the copyright to the material. It is the patron's obligation to determine and satisfy copyright restrictions when publishing or otherwise distributing materials found in our collections.",clir_grant_audio_metadata,,,,,,,,,,,,,,,,,,,,,,,,,,,,,,,,,,,,,,,,,,,,0:53:59,,,,,,,,,,,,,,,,,,,,,,,,,,,,,,,,,,"Oral History","http://libarchstor2.uah.edu/digitalcollections/files/original/73/1521/spc_youn_000020_01.mp3,http://libarchstor2.uah.edu/digitalcollections/files/original/73/1521/spc_youn_000020_02.mp3","Oral History","Anthony Young Collection",1,0
1520,http://libarchstor2.uah.edu/digitalcollections/items/show/1520,spc_youn_000019_01^^spc_youn_000019_02^^MC_8_019,"Ron Creel.",,,"Young, Anthony",,2005-03-07,2000-2009,,,,Interviews^^Audio,Audiocassettes,"Young Collection^^University of Alabama in Huntsville Archives, Special Collections, and Digital Initiatives, Huntsville, Alabama",,,,en,"This material may be protected under U. S. Copyright Law (Title 17, U.S. Code) which governs the making of photocopies or reproductions of copyrighted materials. You may use the digitized material for private study, scholarship, or research. Though the University of Alabama in Huntsville Archives and Special Collections has physical ownership of the material in its collections, in some cases we may not own the copyright to the material. It is the patron's obligation to determine and satisfy copyright restrictions when publishing or otherwise distributing materials found in our collections.",clir_grant_audio_metadata,,,,,,,,,,,,,,,,,,,,,,,,,,,,,,,,,,,,,,,,,,,,1:02:32,,,,,,,,,,,,,,,,,,,,,,,,,,,,,,,,,,"Oral History","http://libarchstor2.uah.edu/digitalcollections/files/original/73/1520/spc_youn_000019_01.mp3,http://libarchstor2.uah.edu/digitalcollections/files/original/73/1520/spc_youn_000019_02.mp3","Oral History","Anthony Young Collection",1,0
1519,http://libarchstor2.uah.edu/digitalcollections/items/show/1519,spc_youn_000018_01^^spc_youn_000018_02^^MC_8_018,"Sam Romano.",,,"Young, Anthony",,2005-08-22,2000-2009,,,,Interviews^^Audio,Audiocassettes,"Young Collection^^University of Alabama in Huntsville Archives, Special Collections, and Digital Initiatives, Huntsville, Alabama",,,,en,"This material may be protected under U. S. Copyright Law (Title 17, U.S. Code) which governs the making of photocopies or reproductions of copyrighted materials. You may use the digitized material for private study, scholarship, or research. Though the University of Alabama in Huntsville Archives and Special Collections has physical ownership of the material in its collections, in some cases we may not own the copyright to the material. It is the patron's obligation to determine and satisfy copyright restrictions when publishing or otherwise distributing materials found in our collections.",clir_grant_audio_metadata,,,,,,,,,,,,,,,,,,,,,,,,,,,,,,,,,,,,,,,,,,,,1:09:02,,,,,,,,,,,,,,,,,,,,,,,,,,,,,,,,,,"Oral History","http://libarchstor2.uah.edu/digitalcollections/files/original/73/1519/spc_youn_000018_01.mp3,http://libarchstor2.uah.edu/digitalcollections/files/original/73/1519/spc_youn_000018_02.mp3","Oral History","Anthony Young Collection",1,0
