﻿"Item Id","Item URI","Dublin Core:Identifier","Dublin Core:Title","Dublin Core:Alternative Title","Dublin Core:Description","Dublin Core:Creator","Dublin Core:Publisher","Dublin Core:Date","Dublin Core:Temporal Coverage","Dublin Core:Coverage","Dublin Core:Spatial Coverage","Dublin Core:Subject","Dublin Core:Type","Dublin Core:Format","Dublin Core:Source","Dublin Core:Is Part Of","Dublin Core:Has Format","Dublin Core:Provenance","Dublin Core:Language","Dublin Core:Rights","Dublin Core:Relation","Dublin Core:Contributor","Dublin Core:Abstract","Dublin Core:Table Of Contents","Dublin Core:Date Available","Dublin Core:Date Created","Dublin Core:Date Accepted","Dublin Core:Date Copyrighted","Dublin Core:Date Submitted","Dublin Core:Date Issued","Dublin Core:Date Modified","Dublin Core:Date Valid","Dublin Core:Access Rights","Dublin Core:License","Dublin Core:Conforms To","Dublin Core:Has Part","Dublin Core:Has Version","Dublin Core:Is Format Of","Dublin Core:Is Referenced By","Dublin Core:Is Replaced By","Dublin Core:Is Required By","Dublin Core:Is Version Of","Dublin Core:References","Dublin Core:Replaces","Dublin Core:Requires","Dublin Core:Extent","Dublin Core:Medium","Dublin Core:Bibliographic Citation","Dublin Core:Accrual Method","Dublin Core:Accrual Periodicity","Dublin Core:Accrual Policy","Dublin Core:Audience","Dublin Core:Audience Education Level","Dublin Core:Mediator","Dublin Core:Instructional Method","Dublin Core:Rights Holder","Item Type Metadata:Text","Item Type Metadata:Interviewer","Item Type Metadata:Interviewee","Item Type Metadata:Location","Item Type Metadata:Transcription","Item Type Metadata:Local URL","Item Type Metadata:Original Format","Item Type Metadata:Physical Dimensions","Item Type Metadata:Duration","Item Type Metadata:Compression","Item Type Metadata:Producer","Item Type Metadata:Director","Item Type Metadata:Bit Rate/Frequency","Item Type Metadata:Time Summary","Item Type Metadata:Email Body","Item Type Metadata:Subject Line","Item Type Metadata:From","Item Type Metadata:To","Item Type Metadata:CC","Item Type Metadata:BCC","Item Type Metadata:Number of Attachments","Item Type Metadata:Standards","Item Type Metadata:Objectives","Item Type Metadata:Materials","Item Type Metadata:Lesson Plan Text","Item Type Metadata:URL","Item Type Metadata:Event Type","Item Type Metadata:Participants","Item Type Metadata:Birth Date","Item Type Metadata:Birthplace","Item Type Metadata:Death Date","Item Type Metadata:Occupation","Item Type Metadata:Biographical Text","Item Type Metadata:Bibliography","Item Type Metadata:Player","Item Type Metadata:Imported Thumbnail","Item Type Metadata:OHMS Object","Item Type Metadata:OHMS Object Text","Item Type Metadata:Interview Keyword","Item Type Metadata:Sort Priority","PDF Text:Text",Scripto:Transcription,tags,file,itemType,collection,public,featured
6986,http://libarchstor2.uah.edu/digitalcollections/items/show/6986,r01b07-01,"Legal and court documents, 1870 (1 of 3)",,,,,,,,,,,,"Series 1, Subseries B, Box 7, Folder 1",,,,,,r01b-210907,,,,,,,,,,,,,,,,,,,,,,,,,,,,,,,,,,,,,,,,,,,,,,,,,,,,,,,,,,,,,,,,,,,,,,,,,,,,,,,http://dkdayton.net/roberts/images/r01b/pdfs/r01b07-01.pdf,"Still Image","Series 01, Subseries B: Cabaniss Professional Business",1,0
6987,http://libarchstor2.uah.edu/digitalcollections/items/show/6987,r01b06-10,"Letters, 1867-1869",,,,,,,,,,,,"Series 1, Subseries B, Box 6, Folder 10",,,,,,r01b-210907,,,,,,,,,,,,,,,,,,,,,,,,,,,,,,,,,,,,,,,,,,,,,,,,,,,,,,,,,,,,,,,,,,,,,,,,,,,,,,,http://dkdayton.net/roberts/images/r01b/pdfs/r01b06-10.pdf,"Still Image","Series 01, Subseries B: Cabaniss Professional Business",1,0
6988,http://libarchstor2.uah.edu/digitalcollections/items/show/6988,r01b06-09,"Legal and court documents, 1869 (2 of 2)",,,,,,,,,,,,"Series 1, Subseries B, Box 6, Folder 9",,,,,,r01b-210907,,,,,,,,,,,,,,,,,,,,,,,,,,,,,,,,,,,,,,,,,,,,,,,,,,,,,,,,,,,,,,,,,,,,,,,,,,,,,,,http://dkdayton.net/roberts/images/r01b/pdfs/r01b06-09.pdf,"Still Image","Series 01, Subseries B: Cabaniss Professional Business",1,0
6989,http://libarchstor2.uah.edu/digitalcollections/items/show/6989,r01b06-08,"Legal and court documents, 1869 (1 of 2)",,,,,,,,,,,,"Series 1, Subseries B, Box 6, Folder 8",,,,,,r01b-210907,,,,,,,,,,,,,,,,,,,,,,,,,,,,,,,,,,,,,,,,,,,,,,,,,,,,,,,,,,,,,,,,,,,,,,,,,,,,,,,http://dkdayton.net/roberts/images/r01b/pdfs/r01b06-08.pdf,"Still Image","Series 01, Subseries B: Cabaniss Professional Business",1,0
6990,http://libarchstor2.uah.edu/digitalcollections/items/show/6990,r01b06-07,"Legal and court documents, 1868 (4 of 4)",,,,,,,,,,,,"Series 1, Subseries B, Box 6, Folder 7",,,,,,r01b-210907,,,,,,,,,,,,,,,,,,,,,,,,,,,,,,,,,,,,,,,,,,,,,,,,,,,,,,,,,,,,,,,,,,,,,,,,,,,,,,,http://dkdayton.net/roberts/images/r01b/pdfs/r01b06-07.pdf,"Still Image","Series 01, Subseries B: Cabaniss Professional Business",1,0
6991,http://libarchstor2.uah.edu/digitalcollections/items/show/6991,r01b06-05,"Legal and court documents, 1868 (2 of 4)",,,,,,,,,,,,"Series 1, Subseries B, Box 6, Folder 5",,,,,,r01b-210907,,,,,,,,,,,,,,,,,,,,,,,,,,,,,,,,,,,,,,,,,,,,,,,,,,,,,,,,,,,,,,,,,,,,,,,,,,,,,,,http://dkdayton.net/roberts/images/r01b/pdfs/r01b06-05.pdf,"Still Image","Series 01, Subseries B: Cabaniss Professional Business",1,0
6992,http://libarchstor2.uah.edu/digitalcollections/items/show/6992,r01b06-04,"Legal and court documents, 1868 (1 of 4) (Nick Davis Bankruptcy)",,,,,,,,,,,,"Series 1, Subseries B, Box 6, Folder 4",,,,,,r01b-210907,,,,,,,,,,,,,,,,,,,,,,,,,,,,,,,,,,,,,,,,,,,,,,,,,,,,,,,,,,,,,,,,,,,,,,,,,,,,,,,http://dkdayton.net/roberts/images/r01b/pdfs/r01b06-04.pdf,"Still Image","Series 01, Subseries B: Cabaniss Professional Business",1,0
6993,http://libarchstor2.uah.edu/digitalcollections/items/show/6993,r01b06-03,"Legal and court documents, 1867",,,,,,,,,,,,"Series 1, Subseries B, Box 6, Folder 3",,,,,,r01b-210907,,,,,,,,,,,,,,,,,,,,,,,,,,,,,,,,,,,,,,,,,,,,,,,,,,,,,,,,,,,,,,,,,,,,,,,,,,,,,,,http://dkdayton.net/roberts/images/r01b/pdfs/r01b06-03.pdf,"Still Image","Series 01, Subseries B: Cabaniss Professional Business",1,0
6994,http://libarchstor2.uah.edu/digitalcollections/items/show/6994,r01b06-02,"Legal and court documents, 1866",,,,,,,,,,,,"Series 1, Subseries B, Box 6, Folder 2",,,,,,r01b-210907,,,,,,,,,,,,,,,,,,,,,,,,,,,,,,,,,,,,,,,,,,,,,,,,,,,,,,,,,,,,,,,,,,,,,,,,,,,,,,,http://dkdayton.net/roberts/images/r01b/pdfs/r01b06-02.pdf,"Still Image","Series 01, Subseries B: Cabaniss Professional Business",1,0
6995,http://libarchstor2.uah.edu/digitalcollections/items/show/6995,r01b06-01,"James McClung Estate, 1840s-1860s",,,,,,,,,,,,"Series 1, Subseries B, Box 6, Folder 1",,,,,,r01b-210907,,,,,,,,,,,,,,,,,,,,,,,,,,,,,,,,,,,,,,,,,,,,,,,,,,,,,,,,,,,,,,,,,,,,,,,,,,,,,,,http://dkdayton.net/roberts/images/r01b/pdfs/r01b06-01.pdf,"Still Image","Series 01, Subseries B: Cabaniss Professional Business",1,0
6996,http://libarchstor2.uah.edu/digitalcollections/items/show/6996,r01b05-09,"Legal and court documents, 1865",,,,,,,,,,,,"Series 1, Subseries B, Box 5, Folder 9",,,,,,r01b-210907,,,,,,,,,,,,,,,,,,,,,,,,,,,,,,,,,,,,,,,,,,,,,,,,,,,,,,,,,,,,,,,,,,,,,,,,,,,,,,,http://dkdayton.net/roberts/images/r01b/pdfs/r01b05-09.pdf,"Still Image","Series 01, Subseries B: Cabaniss Professional Business",1,0
6997,http://libarchstor2.uah.edu/digitalcollections/items/show/6997,r01b05-08,"Legal and court documents, 1864",,,,,,,,,,,,"Series 1, Subseries B, Box 5, Folder 8",,,,,,r01b-210907,,,,,,,,,,,,,,,,,,,,,,,,,,,,,,,,,,,,,,,,,,,,,,,,,,,,,,,,,,,,,,,,,,,,,,,,,,,,,,,http://dkdayton.net/roberts/images/r01b/pdfs/r01b05-08.pdf,"Still Image","Series 01, Subseries B: Cabaniss Professional Business",1,0
6998,http://libarchstor2.uah.edu/digitalcollections/items/show/6998,r01b05-07,"Legal and court documents, 1863",,,,,,,,,,,,"Series 1, Subseries B, Box 5, Folder 7",,,,,,r01b-210907,,,,,,,,,,,,,,,,,,,,,,,,,,,,,,,,,,,,,,,,,,,,,,,,,,,,,,,,,,,,,,,,,,,,,,,,,,,,,,,http://dkdayton.net/roberts/images/r01b/pdfs/r01b05-07.pdf,"Still Image","Series 01, Subseries B: Cabaniss Professional Business",1,0
6999,http://libarchstor2.uah.edu/digitalcollections/items/show/6999,r01b05-06,"Legal and court documents, 1862",,,,,,,,,,,,"Series 1, Subseries B, Box 5, Folder 6",,,,,,r01b-210907,,,,,,,,,,,,,,,,,,,,,,,,,,,,,,,,,,,,,,,,,,,,,,,,,,,,,,,,,,,,,,,,,,,,,,,,,,,,,,,http://dkdayton.net/roberts/images/r01b/pdfs/r01b05-06.pdf,"Still Image","Series 01, Subseries B: Cabaniss Professional Business",1,0
7000,http://libarchstor2.uah.edu/digitalcollections/items/show/7000,r01b05-05,"Legal and court documents, 1861",,,,,,,,,,,,"Series 1, Subseries B, Box 5, Folder 5",,,,,,r01b-210907,,,,,,,,,,,,,,,,,,,,,,,,,,,,,,,,,,,,,,,,,,,,,,,,,,,,,,,,,,,,,,,,,,,,,,,,,,,,,,,http://dkdayton.net/roberts/images/r01b/pdfs/r01b05-05.pdf,"Still Image","Series 01, Subseries B: Cabaniss Professional Business",1,0
7001,http://libarchstor2.uah.edu/digitalcollections/items/show/7001,r01b05-04,"Legal and court documents, 1860 (4 of 4)",,,,,,,,,,,,"Series 1, Subseries B, Box 5, Folder 4",,,,,,r01b-210907,,,,,,,,,,,,,,,,,,,,,,,,,,,,,,,,,,,,,,,,,,,,,,,,,,,,,,,,,,,,,,,,,,,,,,,,,,,,,,,http://dkdayton.net/roberts/images/r01b/pdfs/r01b05-04.pdf,"Still Image","Series 01, Subseries B: Cabaniss Professional Business",1,0
7002,http://libarchstor2.uah.edu/digitalcollections/items/show/7002,r01b05-03,"Legal and court documents, 1860 (3 of 4)",,"Robinson estate",,,,,,,,,,"Series 1, Subseries B, Box 5, Folder 3",,,,,,r01b-210907,,,,,,,,,,,,,,,,,,,,,,,,,,,,,,,,,,,,,,,,,,,,,,,,,,,,,,,,,,,,,,,,,,,,,,,,,,,,,,,http://dkdayton.net/roberts/images/r01b/pdfs/r01b05-03.pdf,"Still Image","Series 01, Subseries B: Cabaniss Professional Business",1,0
7003,http://libarchstor2.uah.edu/digitalcollections/items/show/7003,r01b05-02,"Legal and court documents, 1860 (2 of 4)",,,,,,,,,,,,"Series 1, Subseries B, Box 5, Folder 2",,,,,,r01b-210907,,,,,,,,,,,,,,,,,,,,,,,,,,,,,,,,,,,,,,,,,,,,,,,,,,,,,,,,,,,,,,,,,,,,,,,,,,,,,,,http://dkdayton.net/roberts/images/r01b/pdfs/r01b05-02.pdf,"Still Image","Series 01, Subseries B: Cabaniss Professional Business",1,0
7004,http://libarchstor2.uah.edu/digitalcollections/items/show/7004,r01b05-01,"Legal and court documents, 1860 (1 of 4)",,"Letter threatening blackmail?",,,,,,,,,,"Series 1, Subseries B, Box 5, Folder 1",,,,,,r01b-210907,,,,,,,,,,,,,,,,,,,,,,,,,,,,,,,,,,,,,,,,,,,,,,,,,,,,,,,,,,,,,,,,,,,,,,,,,,,,,,,http://dkdayton.net/roberts/images/r01b/pdfs/r01b05-01.pdf,"Still Image","Series 01, Subseries B: Cabaniss Professional Business",1,0
7005,http://libarchstor2.uah.edu/digitalcollections/items/show/7005,r01b04-23,"Depositions to Routt vs. Tate (14 of 14)",,,,,,,,,,,,"Series 1, Subseries B, Box 4, Folder 23",,,,,,r01b-210907,,,,,,,,,,,,,,,,,,,,,,,,,,,,,,,,,,,,,,,,,,,,,,,,,,,,,,,,,,,,,,,,,,,,,,,,,,,,,,,http://dkdayton.net/roberts/images/r01b/pdfs/r01b04-23.pdf,"Still Image","Series 01, Subseries B: Cabaniss Professional Business",1,0
7006,http://libarchstor2.uah.edu/digitalcollections/items/show/7006,r01b04-22,"Depositions to Routt vs. Tate (13 of 14)",,,,,,,,,,,,"Series 1, Subseries B, Box 4, Folder 22",,,,,,r01b-210907,,,,,,,,,,,,,,,,,,,,,,,,,,,,,,,,,,,,,,,,,,,,,,,,,,,,,,,,,,,,,,,,,,,,,,,,,,,,,,,http://dkdayton.net/roberts/images/r01b/pdfs/r01b04-22.pdf,"Still Image","Series 01, Subseries B: Cabaniss Professional Business",1,0
7007,http://libarchstor2.uah.edu/digitalcollections/items/show/7007,r01b04-21,"Depositions to Routt vs. Tate (12 of 14)",,,,,,,,,,,,"Series 1, Subseries B, Box 4, Folder 21",,,,,,r01b-210907,,,,,,,,,,,,,,,,,,,,,,,,,,,,,,,,,,,,,,,,,,,,,,,,,,,,,,,,,,,,,,,,,,,,,,,,,,,,,,,http://dkdayton.net/roberts/images/r01b/pdfs/r01b04-21.pdf,"Still Image","Series 01, Subseries B: Cabaniss Professional Business",1,0
7008,http://libarchstor2.uah.edu/digitalcollections/items/show/7008,r01b04-20,"Depositions to Routt vs. Tate (11 of 14)",,,,,,,,,,,,"Series 1, Subseries B, Box 4, Folder 20",,,,,,r01b-210907,,,,,,,,,,,,,,,,,,,,,,,,,,,,,,,,,,,,,,,,,,,,,,,,,,,,,,,,,,,,,,,,,,,,,,,,,,,,,,,http://dkdayton.net/roberts/images/r01b/pdfs/r01b04-20.pdf,"Still Image","Series 01, Subseries B: Cabaniss Professional Business",1,0
7009,http://libarchstor2.uah.edu/digitalcollections/items/show/7009,r01b04-19,"Depositions to Routt vs. Tate (10 of 14)",,,,,,,,,,,,"Series 1, Subseries B, Box 4, Folder 19",,,,,,r01b-210907,,,,,,,,,,,,,,,,,,,,,,,,,,,,,,,,,,,,,,,,,,,,,,,,,,,,,,,,,,,,,,,,,,,,,,,,,,,,,,,http://dkdayton.net/roberts/images/r01b/pdfs/r01b04-19.pdf,"Still Image","Series 01, Subseries B: Cabaniss Professional Business",1,0
7010,http://libarchstor2.uah.edu/digitalcollections/items/show/7010,r01b04-18,"Depositions to Routt vs. Tate (9 of 14)",,,"Sanders, William W. ",,,1850-1859,,,"Murder--United States^^Tate, Abner^^Theft^^Hazel, Barbara^^Madison County (Ala.)",Deposition,,"Series 1, Subseries B, Box 4, Folder 18",,,,en,"This material may be protected under U. S. Copyright Law (Title 17, U.S. Code) which governs the making of photocopies or reproductions of copyrighted materials. You may use the digitized material for private study, scholarship, or research. Though the University of Alabama in Huntsville Archives and Special Collections has physical ownership of the material in its collections, in some cases we may not own the copyright to the material. It is the patron's obligation to determine and satisfy copyright restrictions when publishing or otherwise distributing materials found in our collections.",r01b-210907,,,,,,,,,,,,,,,,,,,,,,,,,,,,,,,,,,,,,,,,,,,,,,,,,,,,,,,,,,,,,,,,,,,,,,,,,,,,,,,http://dkdayton.net/roberts/images/r01b/pdfs/r01b04-18.pdf,"Still Image","Series 01, Subseries B: Cabaniss Professional Business",1,0
7011,http://libarchstor2.uah.edu/digitalcollections/items/show/7011,r01b04-17,"Depositions to Routt vs. Tate (8 of 14)",,,"Pool, Sarah",,,1840-1849^^1850-1859,,,"Marshall County (Miss.)^^Tate, Abner^^Friendship--1850-1860^^Hazel, Barbara^^Murder--United States",,,"Series 1, Subseries B, Box 4, Folder 17",,,,en,"This material may be protected under U. S. Copyright Law (Title 17, U.S. Code) which governs the making of photocopies or reproductions of copyrighted materials. You may use the digitized material for private study, scholarship, or research. Though the University of Alabama in Huntsville Archives and Special Collections has physical ownership of the material in its collections, in some cases we may not own the copyright to the material. It is the patron's obligation to determine and satisfy copyright restrictions when publishing or otherwise distributing materials found in our collections.",r01b-210907,,,,,,,,,,,,,,,,,,,,,,,,,,,,,,,,,,,,,,,,,,,,,,,,,,,,,,,,,,,,,,,,,,,,,,,,,,,,,,,http://dkdayton.net/roberts/images/r01b/pdfs/r01b04-17.pdf,"Still Image","Series 01, Subseries B: Cabaniss Professional Business",1,0
7012,http://libarchstor2.uah.edu/digitalcollections/items/show/7012,r01b04-16,"Depositions to Routt vs. Tate (7 of 14)",,,"Gill, T.O. ",,,1850-1859,,,"Crime scene investigations^^Porches^^Kitchens^^Tate, Abner^^Hazel, Barbara",Deposition,,"Series 1, Subseries B, Box 4, Folder 16",,,,en,"This material may be protected under U. S. Copyright Law (Title 17, U.S. Code) which governs the making of photocopies or reproductions of copyrighted materials. You may use the digitized material for private study, scholarship, or research. Though the University of Alabama in Huntsville Archives and Special Collections has physical ownership of the material in its collections, in some cases we may not own the copyright to the material. It is the patron's obligation to determine and satisfy copyright restrictions when publishing or otherwise distributing materials found in our collections.",r01b-210907,,,,,,,,,,,,,,,,,,,,,,,,,,,,,,,,,,,,,,,,,,,,,,,,,,,,,,,,,,,,,,,,,,,,,,,,,,,,,,,http://dkdayton.net/roberts/images/r01b/pdfs/r01b04-16.pdf,"Still Image","Series 01, Subseries B: Cabaniss Professional Business",1,0
7013,http://libarchstor2.uah.edu/digitalcollections/items/show/7013,r01b04-15,"Depositions to Routt vs. Tate (6 of 14)",,,"Connor, William M.",,,1840-1849^^1850-1859,,,"Tate, Abner^^Assault--cow hide^^Denial^^Hazel, Barbara^^Family life",Correspondence,,"Series 1, Subseries B, Box 4, Folder 15",,,,en,"This material may be protected under U. S. Copyright Law (Title 17, U.S. Code) which governs the making of photocopies or reproductions of copyrighted materials. You may use the digitized material for private study, scholarship, or research. Though the University of Alabama in Huntsville Archives and Special Collections has physical ownership of the material in its collections, in some cases we may not own the copyright to the material. It is the patron's obligation to determine and satisfy copyright restrictions when publishing or otherwise distributing materials found in our collections.",r01b-210907,,,,,,,,,,,,,,,,,,,,,,,,,,,,,,,,,,,,,,,,,,,,,,,,,,,,,,,,,,,,,,,,,,,,,,,,,,,,,,,http://dkdayton.net/roberts/images/r01b/pdfs/r01b04-15.pdf,"Still Image","Series 01, Subseries B: Cabaniss Professional Business",1,0
7014,http://libarchstor2.uah.edu/digitalcollections/items/show/7014,r01b04-14,"Depositions to Routt vs. Tate (5 of 14)",,,"Purdom, Richard B.^^Townsend, Edmund",,,1840-1849^^1850-1859,,,"Cotton ginning^^Hazel Green (Ala.)^^Land sales contracts^^Madison County (Ala.)^^High, Elizabeth",Deed^^Receipt,,"Series 1, Subseries B, Box 4, Folder 14",,,,en,"This material may be protected under U. S. Copyright Law (Title 17, U.S. Code) which governs the making of photocopies or reproductions of copyrighted materials. You may use the digitized material for private study, scholarship, or research. Though the University of Alabama in Huntsville Archives and Special Collections has physical ownership of the material in its collections, in some cases we may not own the copyright to the material. It is the patron's obligation to determine and satisfy copyright restrictions when publishing or otherwise distributing materials found in our collections.",r01b-210907,,,,,,,,,,,,,,,,,,,,,,,,,,,,,,,,,,,,,,,,,,,,,,,,,,,,,,,,,,,,,,,,,,,,,,,,,,,,,,,http://dkdayton.net/roberts/images/r01b/pdfs/r01b04-14.pdf,"Still Image","Series 01, Subseries B: Cabaniss Professional Business",1,0
7015,http://libarchstor2.uah.edu/digitalcollections/items/show/7015,r01b04-13,"Depositions to Routt vs. Tate (4 of 14)",,,"Hazel, Barbara^^Bingham, D.H. ",,,1850-1859,,,"Murder--United States^^Tate, Abner^^Wheat^^Hazel, Barbara^^Alfred (enslaved man)",Correspondence^^Testimony,,"Series 1, Subseries B, Box 4, Folder 13",,,,en,"This material may be protected under U. S. Copyright Law (Title 17, U.S. Code) which governs the making of photocopies or reproductions of copyrighted materials. You may use the digitized material for private study, scholarship, or research. Though the University of Alabama in Huntsville Archives and Special Collections has physical ownership of the material in its collections, in some cases we may not own the copyright to the material. It is the patron's obligation to determine and satisfy copyright restrictions when publishing or otherwise distributing materials found in our collections.",r01b-210907,,,,,,,,,,,,,,,,,,,,,,,,,,,,,,,,,,,,,,,,,,,,,,,,,,,,,,,,,,,,,,,,,,,,,,,,,,,,,,,http://dkdayton.net/roberts/images/r01b/pdfs/r01b04-13.pdf,"Still Image","Series 01, Subseries B: Cabaniss Professional Business",1,0
7016,http://libarchstor2.uah.edu/digitalcollections/items/show/7016,r01b04-12,"Depositions to Routt vs. Tate (3 of 14)",,,"Bingham, D.H. ",,,1850-1859,,,"Murder--United States^^Tate, Abner^^Phrenology^^New Market (Ala.)^^Gerons (settlement)",Correspondence,,"Series 1, Subseries B, Box 4, Folder 12",,,,en,"This material may be protected under U. S. Copyright Law (Title 17, U.S. Code) which governs the making of photocopies or reproductions of copyrighted materials. You may use the digitized material for private study, scholarship, or research. Though the University of Alabama in Huntsville Archives and Special Collections has physical ownership of the material in its collections, in some cases we may not own the copyright to the material. It is the patron's obligation to determine and satisfy copyright restrictions when publishing or otherwise distributing materials found in our collections.",r01b-210907,,,,,,,,,,,,,,,,,,,,,,,,,,,,,,,,,,,,,,,,,,,,,,,,,,,,,,,,,,,,,,,,,,,,,,,,,,,,,,,http://dkdayton.net/roberts/images/r01b/pdfs/r01b04-12.pdf,"Still Image","Series 01, Subseries B: Cabaniss Professional Business",1,0
7017,http://libarchstor2.uah.edu/digitalcollections/items/show/7017,r01b04-11,"Depositions to Routt vs. Tate (2 of 14)",,,"Bingham, D.H. ",,,1840-1849^^1850-1859,,,"Tate, Abner^^Murder--United States^^George Cabiness (enslaved man)^^Coffee County (Tenn.)^^Theft^^Carnation industry",,,"Series 1, Subseries B, Box 4, Folder 11",,,,en,"This material may be protected under U. S. Copyright Law (Title 17, U.S. Code) which governs the making of photocopies or reproductions of copyrighted materials. You may use the digitized material for private study, scholarship, or research. Though the University of Alabama in Huntsville Archives and Special Collections has physical ownership of the material in its collections, in some cases we may not own the copyright to the material. It is the patron's obligation to determine and satisfy copyright restrictions when publishing or otherwise distributing materials found in our collections.",r01b-210907,,,,,,,,,,,,,,,,,,,,,,,,,,,,,,,,,,,,,,,,,,,,,,,,,,,,,,,,,,,,,,,,,,,,,,,,,,,,,,,http://dkdayton.net/roberts/images/r01b/pdfs/r01b04-11.pdf,"Still Image","Series 01, Subseries B: Cabaniss Professional Business",1,0
7018,http://libarchstor2.uah.edu/digitalcollections/items/show/7018,r01b04-10,"Depositions to Routt vs. Tate (1 of 14)",,,"Tate, Abner^^Clay, C.C.",,"September 4, 1855",1840-1849^^1850-1859,,,"Murder^^Conspiracy^^Connor County (Tenn.)^^Extradition^^Bingham, D.H.",Correspondence,,"Series 1, Subseries B, Box 4, Folder 10",,,,en,"This material may be protected under U. S. Copyright Law (Title 17, U.S. Code) which governs the making of photocopies or reproductions of copyrighted materials. You may use the digitized material for private study, scholarship, or research. Though the University of Alabama in Huntsville Archives and Special Collections has physical ownership of the material in its collections, in some cases we may not own the copyright to the material. It is the patron's obligation to determine and satisfy copyright restrictions when publishing or otherwise distributing materials found in our collections.",r01b-210907,,,,,,,,,,,,,,,,,,,,,,,,,,,,,,,,,,,,,,,,,,,,,,,,,,,,,,,,,,,,,,,,,,,,,,,,,,,,,,,http://dkdayton.net/roberts/images/r01b/pdfs/r01b04-10.pdf,"Still Image","Series 01, Subseries B: Cabaniss Professional Business",1,0
7019,http://libarchstor2.uah.edu/digitalcollections/items/show/7019,r01b04-09,"Letter from Barbara Hazel to Martha Flynt",,,"Hazel, Barbara",,"January 14, 1844",1840-1849,,,"Corn as food^^Pork industry and trade--United States^^Tishomingo (Miss.)^^Family life^^Hazel Green (Ala.)",Correspondence,,"Series 1, Subseries B, Box 4, Folder 9",,,,en,"This material may be protected under U. S. Copyright Law (Title 17, U.S. Code) which governs the making of photocopies or reproductions of copyrighted materials. You may use the digitized material for private study, scholarship, or research. Though the University of Alabama in Huntsville Archives and Special Collections has physical ownership of the material in its collections, in some cases we may not own the copyright to the material. It is the patron's obligation to determine and satisfy copyright restrictions when publishing or otherwise distributing materials found in our collections.",r01b-210907,,,,,,,,,,,,,,,,,,,,,,,,,,,,,,,,,,,,,,,,,,,,,,,,,,,,,,,,,,,,,,,,,,,,,,,,,,,,,,,http://dkdayton.net/roberts/images/r01b/pdfs/r01b04-09.pdf,"Still Image","Series 01, Subseries B: Cabaniss Professional Business",1,0