﻿"Item Id","Item URI","Dublin Core:Identifier","Dublin Core:Title","Dublin Core:Alternative Title","Dublin Core:Description","Dublin Core:Creator","Dublin Core:Publisher","Dublin Core:Date","Dublin Core:Temporal Coverage","Dublin Core:Coverage","Dublin Core:Spatial Coverage","Dublin Core:Subject","Dublin Core:Type","Dublin Core:Format","Dublin Core:Source","Dublin Core:Is Part Of","Dublin Core:Has Format","Dublin Core:Provenance","Dublin Core:Language","Dublin Core:Rights","Dublin Core:Relation","Dublin Core:Contributor","Dublin Core:Abstract","Dublin Core:Table Of Contents","Dublin Core:Date Available","Dublin Core:Date Created","Dublin Core:Date Accepted","Dublin Core:Date Copyrighted","Dublin Core:Date Submitted","Dublin Core:Date Issued","Dublin Core:Date Modified","Dublin Core:Date Valid","Dublin Core:Access Rights","Dublin Core:License","Dublin Core:Conforms To","Dublin Core:Has Part","Dublin Core:Has Version","Dublin Core:Is Format Of","Dublin Core:Is Referenced By","Dublin Core:Is Replaced By","Dublin Core:Is Required By","Dublin Core:Is Version Of","Dublin Core:References","Dublin Core:Replaces","Dublin Core:Requires","Dublin Core:Extent","Dublin Core:Medium","Dublin Core:Bibliographic Citation","Dublin Core:Accrual Method","Dublin Core:Accrual Periodicity","Dublin Core:Accrual Policy","Dublin Core:Audience","Dublin Core:Audience Education Level","Dublin Core:Mediator","Dublin Core:Instructional Method","Dublin Core:Rights Holder","Item Type Metadata:Text","Item Type Metadata:Interviewer","Item Type Metadata:Interviewee","Item Type Metadata:Location","Item Type Metadata:Transcription","Item Type Metadata:Local URL","Item Type Metadata:Original Format","Item Type Metadata:Physical Dimensions","Item Type Metadata:Duration","Item Type Metadata:Compression","Item Type Metadata:Producer","Item Type Metadata:Director","Item Type Metadata:Bit Rate/Frequency","Item Type Metadata:Time Summary","Item Type Metadata:Email Body","Item Type Metadata:Subject Line","Item Type Metadata:From","Item Type Metadata:To","Item Type Metadata:CC","Item Type Metadata:BCC","Item Type Metadata:Number of Attachments","Item Type Metadata:Standards","Item Type Metadata:Objectives","Item Type Metadata:Materials","Item Type Metadata:Lesson Plan Text","Item Type Metadata:URL","Item Type Metadata:Event Type","Item Type Metadata:Participants","Item Type Metadata:Birth Date","Item Type Metadata:Birthplace","Item Type Metadata:Death Date","Item Type Metadata:Occupation","Item Type Metadata:Biographical Text","Item Type Metadata:Bibliography","Item Type Metadata:Player","Item Type Metadata:Imported Thumbnail","Item Type Metadata:OHMS Object","Item Type Metadata:OHMS Object Text","Item Type Metadata:Interview Keyword","Item Type Metadata:Sort Priority","PDF Text:Text",Scripto:Transcription,tags,file,itemType,collection,public,featured
3229,http://libarchstor2.uah.edu/digitalcollections/items/show/3229,loc_burw_000014,"Receipt from 1108th Engineer Combat Group to Edwin Burwell for March of 1944.",,,"United States. Army. Engineer Combat Group, 1108th",,1944-3,1940-1949,,,"Burwell, Edwin D., Jr.^^United States. Army. Engineer Combat Group, 1108th^^Wages","Receipts (financial records)^^Text",,"Burwell Family Collection^^University of Alabama in Huntsville Archives, Special Collections, and Digital Initiatives, Huntsville, Alabama",,,,en,"This material may be protected under U. S. Copyright Law (Title 17, U.S. Code) which governs the making of photocopies or reproductions of copyrighted materials. You may use the digitized material for private study, scholarship, or research. Though the University of Alabama in Huntsville Archives and Special Collections has physical ownership of the material in its collections, in some cases we may not own the copyright to the material. It is the patron's obligation to determine and satisfy copyright restrictions when publishing or otherwise distributing materials found in our collections.",loc_burw_2021_02,,,,,,,,,,,,,,,,,,,,,,,,,,,,,,,,,,,,,,,,,,,,,,,,,,,,,,,,,,,,,,,,,,,,,,,,,,,,,,,http://libarchstor2.uah.edu/digitalcollections/files/original/76/3229/loc_burw_-14.pdf,,"Burwell Family Collection",1,0
3230,http://libarchstor2.uah.edu/digitalcollections/items/show/3230,loc_burw_000015,"Receipt from 1108th Engineer Combat Group to Edwin Burwell for April of 1944.",,,"United States. Army. Engineer Combat Group, 1108th",,1944-4,1940-1949,,,"Burwell, Edwin D., Jr.^^United States. Army. Engineer Combat Group, 1108th^^Wages","Receipts (financial records)^^Text",,"Burwell Family Collection^^University of Alabama in Huntsville Archives, Special Collections, and Digital Initiatives, Huntsville, Alabama",,,,en,"This material may be protected under U. S. Copyright Law (Title 17, U.S. Code) which governs the making of photocopies or reproductions of copyrighted materials. You may use the digitized material for private study, scholarship, or research. Though the University of Alabama in Huntsville Archives and Special Collections has physical ownership of the material in its collections, in some cases we may not own the copyright to the material. It is the patron's obligation to determine and satisfy copyright restrictions when publishing or otherwise distributing materials found in our collections.",loc_burw_2021_02,,,,,,,,,,,,,,,,,,,,,,,,,,,,,,,,,,,,,,,,,,,,,,,,,,,,,,,,,,,,,,,,,,,,,,,,,,,,,,,http://libarchstor2.uah.edu/digitalcollections/files/original/76/3230/loc_burw_-15.pdf,,"Burwell Family Collection",1,0
3238,http://libarchstor2.uah.edu/digitalcollections/items/show/3238,loc_burw_000024,"Receipt for Edwin Burwell from the 1147th Engineer Combat Group.",,,,,1944,1940-1949,,,"Burwell, Edwin D., Jr.^^United States. Army. Engineer Combat Group, 1147th^^Expense accounts","Receipts (financial records)^^Text",,"Burwell Family Collection^^University of Alabama in Huntsville Archives, Special Collections, and Digital Initiatives, Huntsville, Alabama",,,,en,"This material may be protected under U. S. Copyright Law (Title 17, U.S. Code) which governs the making of photocopies or reproductions of copyrighted materials. You may use the digitized material for private study, scholarship, or research. Though the University of Alabama in Huntsville Archives and Special Collections has physical ownership of the material in its collections, in some cases we may not own the copyright to the material. It is the patron's obligation to determine and satisfy copyright restrictions when publishing or otherwise distributing materials found in our collections.",loc_burw_2021_02,,,,,,,,,,,,,,,,,,,,,,,,,,,,,,,,,,,,,,,,,,,,,,,,,,,,,,,,,,,,,,,,,,,,,,,,,,,,,,,http://libarchstor2.uah.edu/digitalcollections/files/original/76/3238/loc_burw_-24.pdf,,"Burwell Family Collection",1,0
3245,http://libarchstor2.uah.edu/digitalcollections/items/show/3245,loc_burw_000031,"Pay voucher for Edwin D. Burwell Jr. for October 1944.",,,"United States. Army. Engineer Combat Group, 1147th",,1944-10,1940-1949,,,"Burwell, Edwin D., Jr.^^United States. Army. Engineer Combat Group, 1147th^^Wages","Receipts (financial records)^^Text",,"Burwell Family Collection^^University of Alabama in Huntsville Archives, Special Collections, and Digital Initiatives, Huntsville, Alabama",,,,en,"This material may be protected under U. S. Copyright Law (Title 17, U.S. Code) which governs the making of photocopies or reproductions of copyrighted materials. You may use the digitized material for private study, scholarship, or research. Though the University of Alabama in Huntsville Archives and Special Collections has physical ownership of the material in its collections, in some cases we may not own the copyright to the material. It is the patron's obligation to determine and satisfy copyright restrictions when publishing or otherwise distributing materials found in our collections.",loc_burw_2021_02,,,,,,,,,,,,,,,,,,,,,,,,,,,,,,,,,,,,,,,,,,,,,,,,,,,,,,,,,,,,,,,,,,,,,,,,,,,,,,,http://libarchstor2.uah.edu/digitalcollections/files/original/76/3245/loc_burw_-31.pdf,,"Burwell Family Collection",1,0
3246,http://libarchstor2.uah.edu/digitalcollections/items/show/3246,loc_burw_000032,"Pay voucher for Edwin D. Burwell Jr. for November 1944.",,,"United States. Army. Engineer Combat Group, 1147th",,11/30/1944,1940-1949,,,"Burwell, Edwin D., Jr.^^United States. Army. Engineer Combat Group, 1147th^^Wages","Receipts (financial records)^^Text",,"Burwell Family Collection^^University of Alabama in Huntsville Archives, Special Collections, and Digital Initiatives, Huntsville, Alabama",,,,en,"This material may be protected under U. S. Copyright Law (Title 17, U.S. Code) which governs the making of photocopies or reproductions of copyrighted materials. You may use the digitized material for private study, scholarship, or research. Though the University of Alabama in Huntsville Archives and Special Collections has physical ownership of the material in its collections, in some cases we may not own the copyright to the material. It is the patron's obligation to determine and satisfy copyright restrictions when publishing or otherwise distributing materials found in our collections.",loc_burw_2021_02,,,,,,,,,,,,,,,,,,,,,,,,,,,,,,,,,,,,,,,,,,,,,,,,,,,,,,,,,,,,,,,,,,,,,,,,,,,,,,,http://libarchstor2.uah.edu/digitalcollections/files/original/76/3246/loc_burw_-32.pdf,,"Burwell Family Collection",1,0
3248,http://libarchstor2.uah.edu/digitalcollections/items/show/3248,loc_burw_000034,"Pay voucher for Edwin D. Burwell Jr. for May 1944.",,,"United States. Army. Engineer Combat Group, 1147th",,1944-05,1940-1949,,,"Burwell, Edwin D., Jr.^^United States. Army. Engineer Combat Group, 1147th^^Wages","Receipts (financial records)^^Text",,"Burwell Family Collection^^University of Alabama in Huntsville Archives, Special Collections, and Digital Initiatives, Huntsville, Alabama",,,,en,"This material may be protected under U. S. Copyright Law (Title 17, U.S. Code) which governs the making of photocopies or reproductions of copyrighted materials. You may use the digitized material for private study, scholarship, or research. Though the University of Alabama in Huntsville Archives and Special Collections has physical ownership of the material in its collections, in some cases we may not own the copyright to the material. It is the patron's obligation to determine and satisfy copyright restrictions when publishing or otherwise distributing materials found in our collections.",loc_burw_2021_02,,,,,,,,,,,,,,,,,,,,,,,,,,,,,,,,,,,,,,,,,,,,,,,,,,,,,,,,,,,,,,,,,,,,,,,,,,,,,,,http://libarchstor2.uah.edu/digitalcollections/files/original/76/3248/loc_burw_-34.pdf,,"Burwell Family Collection",1,0
3249,http://libarchstor2.uah.edu/digitalcollections/items/show/3249,loc_burw_000035,"Pay voucher for Edwin D. Burwell Jr. for December 1943.",,,"United States. Army. Engineer Combat Group, 1147th",,1943-12,1940-1949,,,"Burwell, Edwin D., Jr.^^United States. Army. Engineer Combat Group, 1147th^^Wages","Receipts (financial records)^^Text",,"Burwell Family Collection^^University of Alabama in Huntsville Archives, Special Collections, and Digital Initiatives, Huntsville, Alabama",,,,en,"This material may be protected under U. S. Copyright Law (Title 17, U.S. Code) which governs the making of photocopies or reproductions of copyrighted materials. You may use the digitized material for private study, scholarship, or research. Though the University of Alabama in Huntsville Archives and Special Collections has physical ownership of the material in its collections, in some cases we may not own the copyright to the material. It is the patron's obligation to determine and satisfy copyright restrictions when publishing or otherwise distributing materials found in our collections.",loc_burw_2021_02,,,,,,,,,,,,,,,,,,,,,,,,,,,,,,,,,,,,,,,,,,,,,,,,,,,,,,,,,,,,,,,,,,,,,,,,,,,,,,,http://libarchstor2.uah.edu/digitalcollections/files/original/76/3249/loc_burw_-35.pdf,,"Burwell Family Collection",1,0
3252,http://libarchstor2.uah.edu/digitalcollections/items/show/3252,loc_burw_000038,"Pay voucher for Edwin D. Burwell Jr. for May and October 1944.",,,"United States. Army. Engineer Combat Group, 1147th",,1944,1940-1949,,,"Burwell, Edwin D., Jr.^^United States. Army. Engineer Combat Group, 1147th^^Wages","Receipts (financial records)^^Text",,"Burwell Family Collection^^University of Alabama in Huntsville Archives, Special Collections, and Digital Initiatives, Huntsville, Alabama",,,,en,"This material may be protected under U. S. Copyright Law (Title 17, U.S. Code) which governs the making of photocopies or reproductions of copyrighted materials. You may use the digitized material for private study, scholarship, or research. Though the University of Alabama in Huntsville Archives and Special Collections has physical ownership of the material in its collections, in some cases we may not own the copyright to the material. It is the patron's obligation to determine and satisfy copyright restrictions when publishing or otherwise distributing materials found in our collections.",loc_burw_2021_02,,,,,,,,,,,,,,,,,,,,,,,,,,,,,,,,,,,,,,,,,,,,,,,,,,,,,,,,,,,,,,,,,,,,,,,,,,,,,,,http://libarchstor2.uah.edu/digitalcollections/files/original/76/3252/loc_burw_-38.pdf,,"Burwell Family Collection",1,0
3253,http://libarchstor2.uah.edu/digitalcollections/items/show/3253,loc_burw_000039,"Pay voucher for Edwin D. Burwell Jr. for February 1945.",,,"United States. Army. Engineer Combat Group, 1147th",,1945-02,1940-1949,,,"Burwell, Edwin D., Jr.^^United States. Army. Engineer Combat Group, 1147th^^Wages","Receipts (financial records)^^Text",,"Burwell Family Collection^^University of Alabama in Huntsville Archives, Special Collections, and Digital Initiatives, Huntsville, Alabama",,,,en,"This material may be protected under U. S. Copyright Law (Title 17, U.S. Code) which governs the making of photocopies or reproductions of copyrighted materials. You may use the digitized material for private study, scholarship, or research. Though the University of Alabama in Huntsville Archives and Special Collections has physical ownership of the material in its collections, in some cases we may not own the copyright to the material. It is the patron's obligation to determine and satisfy copyright restrictions when publishing or otherwise distributing materials found in our collections.",loc_burw_2021_02,,,,,,,,,,,,,,,,,,,,,,,,,,,,,,,,,,,,,,,,,,,,,,,,,,,,,,,,,,,,,,,,,,,,,,,,,,,,,,,http://libarchstor2.uah.edu/digitalcollections/files/original/76/3253/loc_burw_-39.pdf,,"Burwell Family Collection",1,0
3256,http://libarchstor2.uah.edu/digitalcollections/items/show/3256,loc_burw_000042,"Pay voucher for Edwin D. Burwell Jr. for March 1945.",,,"United States. Army. Engineer Combat Group, 1147th",,1945-03,1940-1949,,,"Burwell, Edwin D., Jr.^^United States. Army. Engineer Combat Group, 1147th^^Wages","Receipts (financial records)^^Text",,"Burwell Family Collection^^University of Alabama in Huntsville Archives, Special Collections, and Digital Initiatives, Huntsville, Alabama",,,,en,"This material may be protected under U. S. Copyright Law (Title 17, U.S. Code) which governs the making of photocopies or reproductions of copyrighted materials. You may use the digitized material for private study, scholarship, or research. Though the University of Alabama in Huntsville Archives and Special Collections has physical ownership of the material in its collections, in some cases we may not own the copyright to the material. It is the patron's obligation to determine and satisfy copyright restrictions when publishing or otherwise distributing materials found in our collections.",loc_burw_2021_02,,,,,,,,,,,,,,,,,,,,,,,,,,,,,,,,,,,,,,,,,,,,,,,,,,,,,,,,,,,,,,,,,,,,,,,,,,,,,,,http://libarchstor2.uah.edu/digitalcollections/files/original/76/3256/loc_burw_-42.pdf,,"Burwell Family Collection",1,0
