﻿"Item Id","Item URI","Dublin Core:Identifier","Dublin Core:Title","Dublin Core:Alternative Title","Dublin Core:Description","Dublin Core:Creator","Dublin Core:Publisher","Dublin Core:Date","Dublin Core:Temporal Coverage","Dublin Core:Coverage","Dublin Core:Spatial Coverage","Dublin Core:Subject","Dublin Core:Type","Dublin Core:Format","Dublin Core:Source","Dublin Core:Is Part Of","Dublin Core:Has Format","Dublin Core:Provenance","Dublin Core:Language","Dublin Core:Rights","Dublin Core:Relation","Dublin Core:Contributor","Dublin Core:Abstract","Dublin Core:Table Of Contents","Dublin Core:Date Available","Dublin Core:Date Created","Dublin Core:Date Accepted","Dublin Core:Date Copyrighted","Dublin Core:Date Submitted","Dublin Core:Date Issued","Dublin Core:Date Modified","Dublin Core:Date Valid","Dublin Core:Access Rights","Dublin Core:License","Dublin Core:Conforms To","Dublin Core:Has Part","Dublin Core:Has Version","Dublin Core:Is Format Of","Dublin Core:Is Referenced By","Dublin Core:Is Replaced By","Dublin Core:Is Required By","Dublin Core:Is Version Of","Dublin Core:References","Dublin Core:Replaces","Dublin Core:Requires","Dublin Core:Extent","Dublin Core:Medium","Dublin Core:Bibliographic Citation","Dublin Core:Accrual Method","Dublin Core:Accrual Periodicity","Dublin Core:Accrual Policy","Dublin Core:Audience","Dublin Core:Audience Education Level","Dublin Core:Mediator","Dublin Core:Instructional Method","Dublin Core:Rights Holder","Item Type Metadata:Text","Item Type Metadata:Interviewer","Item Type Metadata:Interviewee","Item Type Metadata:Location","Item Type Metadata:Transcription","Item Type Metadata:Local URL","Item Type Metadata:Original Format","Item Type Metadata:Physical Dimensions","Item Type Metadata:Duration","Item Type Metadata:Compression","Item Type Metadata:Producer","Item Type Metadata:Director","Item Type Metadata:Bit Rate/Frequency","Item Type Metadata:Time Summary","Item Type Metadata:Email Body","Item Type Metadata:Subject Line","Item Type Metadata:From","Item Type Metadata:To","Item Type Metadata:CC","Item Type Metadata:BCC","Item Type Metadata:Number of Attachments","Item Type Metadata:Standards","Item Type Metadata:Objectives","Item Type Metadata:Materials","Item Type Metadata:Lesson Plan Text","Item Type Metadata:URL","Item Type Metadata:Event Type","Item Type Metadata:Participants","Item Type Metadata:Birth Date","Item Type Metadata:Birthplace","Item Type Metadata:Death Date","Item Type Metadata:Occupation","Item Type Metadata:Biographical Text","Item Type Metadata:Bibliography","Item Type Metadata:Player","Item Type Metadata:Imported Thumbnail","Item Type Metadata:OHMS Object","Item Type Metadata:OHMS Object Text","Item Type Metadata:Interview Keyword","Item Type Metadata:Sort Priority","PDF Text:Text",Scripto:Transcription,tags,file,itemType,collection,public,featured
7041,http://libarchstor2.uah.edu/digitalcollections/items/show/7041,r01b01-09,"Legal and court documents, 1844",,,"Parsons, Silas^^Montelius & Fuller",,,1830-1839^^1840-1849,,,"Whitesburg (Ala.)^^Pork industry--United States^^Bankruptcy^^Cotton trade^^Debt","Deed of trust^^Correspondence^^Receipt",,"Series 1, Subseries B, Box 1, Folder 9",,,,en,"This material may be protected under U. S. Copyright Law (Title 17, U.S. Code) which governs the making of photocopies or reproductions of copyrighted materials. You may use the digitized material for private study, scholarship, or research. Though the University of Alabama in Huntsville Archives and Special Collections has physical ownership of the material in its collections, in some cases we may not own the copyright to the material. It is the patron's obligation to determine and satisfy copyright restrictions when publishing or otherwise distributing materials found in our collections.",r01b-210907,,,,,,,,,,,,,,,,,,,,,,,,,,,,,,,,,,,,,,,,,,,,,,,,,,,,,,,,,,,,,,,,,,,,,,,,,,,,,,,http://dkdayton.net/roberts/images/r01b/pdfs/r01b01-09.pdf,"Still Image","Series 01, Subseries B: Cabaniss Professional Business",1,0
7039,http://libarchstor2.uah.edu/digitalcollections/items/show/7039,r01b02-01,"Legal and court documents, 1846",,,"Fearn, Thomas^^Steele, George^^Tate, Abner",,,1840-1849,,,"Whitesburg (Ala.)^^Spinning^^New Orleans (La.)^^Pork industry-- United States^^Cotton trade",Receipt^^Correspondence,,"Series 1, Subseries B, Box 2, Folder 1",,,,en,"This material may be protected under U. S. Copyright Law (Title 17, U.S. Code) which governs the making of photocopies or reproductions of copyrighted materials. You may use the digitized material for private study, scholarship, or research. Though the University of Alabama in Huntsville Archives and Special Collections has physical ownership of the material in its collections, in some cases we may not own the copyright to the material. It is the patron's obligation to determine and satisfy copyright restrictions when publishing or otherwise distributing materials found in our collections.",r01b-210907,,,,,,,,,,,,,,,,,,,,,,,,,,,,,,,,,,,,,,,,,,,,,,,,,,,,,,,,,,,,,,,,,,,,,,,,,,,,,,,http://dkdayton.net/roberts/images/r01b/pdfs/r01b02-01.pdf,"Still Image","Series 01, Subseries B: Cabaniss Professional Business",1,0
7037,http://libarchstor2.uah.edu/digitalcollections/items/show/7037,r01b02-03,"Legal and court documents, 1848",,,"Parsons, Silas^^McClung, James M.",,,1840-1849,,,"Pork industry and trade--United States^^Enslavement^^Huntsville (Ala.)^^New York (N.Y.)^^Corn as food",Correspondence^^Receipt,,"Series 1, Subseries B, Box 2, Folder 3",,,,en,"This material may be protected under U. S. Copyright Law (Title 17, U.S. Code) which governs the making of photocopies or reproductions of copyrighted materials. You may use the digitized material for private study, scholarship, or research. Though the University of Alabama in Huntsville Archives and Special Collections has physical ownership of the material in its collections, in some cases we may not own the copyright to the material. It is the patron's obligation to determine and satisfy copyright restrictions when publishing or otherwise distributing materials found in our collections.",r01b-210907,,,,,,,,,,,,,,,,,,,,,,,,,,,,,,,,,,,,,,,,,,,,,,,,,,,,,,,,,,,,,,,,,,,,,,,,,,,,,,,http://dkdayton.net/roberts/images/r01b/pdfs/r01b02-03.pdf,"Still Image","Series 01, Subseries B: Cabaniss Professional Business",1,0
7035,http://libarchstor2.uah.edu/digitalcollections/items/show/7035,r01b02-05,"Legal and court documents, 1849 (2 of 2)",,,"Hardin, John T. ^^Hammond, F.L. ",,,1840-1849^^1850-1859,,,"Limestone County (Ala.)^^Alcoholic beverages^^Carriage industry^^Blacksmithing^^Debt^^Medical care","Receipt^^Estate^^Promissory note",,"Series 1, Subseries B, Box 2, Folder 5",,,,en,"This material may be protected under U. S. Copyright Law (Title 17, U.S. Code) which governs the making of photocopies or reproductions of copyrighted materials. You may use the digitized material for private study, scholarship, or research. Though the University of Alabama in Huntsville Archives and Special Collections has physical ownership of the material in its collections, in some cases we may not own the copyright to the material. It is the patron's obligation to determine and satisfy copyright restrictions when publishing or otherwise distributing materials found in our collections.",r01b-210907,,,,,,,,,,,,,,,,,,,,,,,,,,,,,,,,,,,,,,,,,,,,,,,,,,,,,,,,,,,,,,,,,,,,,,,,,,,,,,,http://dkdayton.net/roberts/images/r01b/pdfs/r01b02-05.pdf,"Still Image","Series 01, Subseries B: Cabaniss Professional Business",1,0
7033,http://libarchstor2.uah.edu/digitalcollections/items/show/7033,r01b03-02,"Legal and court documents, 1851",,,"Cabaniss, S.D. ^^Spotswood, Sally D. ^^Fearn & Donegan Co. ",,,1850-1859,,,"Boardinghouses^^Grandparents^^Taverns^^Free African Americans^^Memphis and Charleston Railroad Company^^Huntsville (Ala.)^^Banks and banking","Travel voucher^^Legal documents^^Receipt",,"Series 1, Subseries B, Box 3, Folder 2",,,,en,"This material may be protected under U. S. Copyright Law (Title 17, U.S. Code) which governs the making of photocopies or reproductions of copyrighted materials. You may use the digitized material for private study, scholarship, or research. Though the University of Alabama in Huntsville Archives and Special Collections has physical ownership of the material in its collections, in some cases we may not own the copyright to the material. It is the patron's obligation to determine and satisfy copyright restrictions when publishing or otherwise distributing materials found in our collections.",r01b-210907,,,,,,,,,,,,,,,,,,,,,,,,,,,,,,,,,,,,,,,,,,,,,,,,,,,,,,,,,,,,,,,,,,,,,,,,,,,,,,,http://dkdayton.net/roberts/images/r01b/pdfs/r01b03-02.pdf,"Still Image","Series 01, Subseries B: Cabaniss Professional Business",1,0
7031,http://libarchstor2.uah.edu/digitalcollections/items/show/7031,r01b03-03b,"Legal and court documents, 1852 (2 of 3)",,"Part 2 of folder 3.","Robinson, Mrs. C.P.^^Trotman & Nance",,,1850-1859,,,"Carriage industry^^Women's education^^Family life^^Stationery^^Latin language--Conversation and phrase books^^Grocers","Receipt^^Account book",,"Series 1, Subseries B, Box 3, Folder 3b",,,,en,"This material may be protected under U. S. Copyright Law (Title 17, U.S. Code) which governs the making of photocopies or reproductions of copyrighted materials. You may use the digitized material for private study, scholarship, or research. Though the University of Alabama in Huntsville Archives and Special Collections has physical ownership of the material in its collections, in some cases we may not own the copyright to the material. It is the patron's obligation to determine and satisfy copyright restrictions when publishing or otherwise distributing materials found in our collections.",r01b-210907,,,,,,,,,,,,,,,,,,,,,,,,,,,,,,,,,,,,,,,,,,,,,,,,,,,,,,,,,,,,,,,,,,,,,,,,,,,,,,,http://dkdayton.net/roberts/images/r01b/pdfs/r01b03-03b.pdf,"Still Image","Series 01, Subseries B: Cabaniss Professional Business",1,0
7030,http://libarchstor2.uah.edu/digitalcollections/items/show/7030,r01b03-04,"Legal and court documents, 1852 (3 of 3)",,,"Cabaniss, S.D.",,,1850-1859^^1860-1869,,,"Leather^^Credit^^Debt^^Memphis & Charleston Railroad Company^^Grocers","Receipt^^Account book^^Promissory note^^Business shares",,"Series 1, Subseries B, Box 3, Folder 4",,,,en,"This material may be protected under U. S. Copyright Law (Title 17, U.S. Code) which governs the making of photocopies or reproductions of copyrighted materials. You may use the digitized material for private study, scholarship, or research. Though the University of Alabama in Huntsville Archives and Special Collections has physical ownership of the material in its collections, in some cases we may not own the copyright to the material. It is the patron's obligation to determine and satisfy copyright restrictions when publishing or otherwise distributing materials found in our collections.",r01b-210907,,,,,,,,,,,,,,,,,,,,,,,,,,,,,,,,,,,,,,,,,,,,,,,,,,,,,,,,,,,,,,,,,,,,,,,,,,,,,,,http://dkdayton.net/roberts/images/r01b/pdfs/r01b03-04.pdf,"Still Image","Series 01, Subseries B: Cabaniss Professional Business",1,0
7023,http://libarchstor2.uah.edu/digitalcollections/items/show/7023,r01b04-05,"Legal and court documents, 1858 (2 of 2)",,,"Cabaniss, Septimus D.^^Norris, George D.",,,1850-1859,,,"Lawrence County (Ala.)^^Cotton trade^^Addresses^^Memphis and Charleston Railroad Company^^Debt",Correspondence^^Receipt,,"Series 1, Subseries B, Box 4, Folder 5",,,,en,"This material may be protected under U. S. Copyright Law (Title 17, U.S. Code) which governs the making of photocopies or reproductions of copyrighted materials. You may use the digitized material for private study, scholarship, or research. Though the University of Alabama in Huntsville Archives and Special Collections has physical ownership of the material in its collections, in some cases we may not own the copyright to the material. It is the patron's obligation to determine and satisfy copyright restrictions when publishing or otherwise distributing materials found in our collections.",r01b-210907,,,,,,,,,,,,,,,,,,,,,,,,,,,,,,,,,,,,,,,,,,,,,,,,,,,,,,,,,,,,,,,,,,,,,,,,,,,,,,,http://dkdayton.net/roberts/images/r01b/pdfs/r01b04-05.pdf,"Still Image","Series 01, Subseries B: Cabaniss Professional Business",1,0
7014,http://libarchstor2.uah.edu/digitalcollections/items/show/7014,r01b04-14,"Depositions to Routt vs. Tate (5 of 14)",,,"Purdom, Richard B.^^Townsend, Edmund",,,1840-1849^^1850-1859,,,"Cotton ginning^^Hazel Green (Ala.)^^Land sales contracts^^Madison County (Ala.)^^High, Elizabeth",Deed^^Receipt,,"Series 1, Subseries B, Box 4, Folder 14",,,,en,"This material may be protected under U. S. Copyright Law (Title 17, U.S. Code) which governs the making of photocopies or reproductions of copyrighted materials. You may use the digitized material for private study, scholarship, or research. Though the University of Alabama in Huntsville Archives and Special Collections has physical ownership of the material in its collections, in some cases we may not own the copyright to the material. It is the patron's obligation to determine and satisfy copyright restrictions when publishing or otherwise distributing materials found in our collections.",r01b-210907,,,,,,,,,,,,,,,,,,,,,,,,,,,,,,,,,,,,,,,,,,,,,,,,,,,,,,,,,,,,,,,,,,,,,,,,,,,,,,,http://dkdayton.net/roberts/images/r01b/pdfs/r01b04-14.pdf,"Still Image","Series 01, Subseries B: Cabaniss Professional Business",1,0
