﻿"Item Id","Item URI","Dublin Core:Identifier","Dublin Core:Title","Dublin Core:Alternative Title","Dublin Core:Description","Dublin Core:Creator","Dublin Core:Publisher","Dublin Core:Date","Dublin Core:Temporal Coverage","Dublin Core:Coverage","Dublin Core:Spatial Coverage","Dublin Core:Subject","Dublin Core:Type","Dublin Core:Format","Dublin Core:Source","Dublin Core:Is Part Of","Dublin Core:Has Format","Dublin Core:Provenance","Dublin Core:Language","Dublin Core:Rights","Dublin Core:Relation","Dublin Core:Contributor","Dublin Core:Abstract","Dublin Core:Table Of Contents","Dublin Core:Date Available","Dublin Core:Date Created","Dublin Core:Date Accepted","Dublin Core:Date Copyrighted","Dublin Core:Date Submitted","Dublin Core:Date Issued","Dublin Core:Date Modified","Dublin Core:Date Valid","Dublin Core:Access Rights","Dublin Core:License","Dublin Core:Conforms To","Dublin Core:Has Part","Dublin Core:Has Version","Dublin Core:Is Format Of","Dublin Core:Is Referenced By","Dublin Core:Is Replaced By","Dublin Core:Is Required By","Dublin Core:Is Version Of","Dublin Core:References","Dublin Core:Replaces","Dublin Core:Requires","Dublin Core:Extent","Dublin Core:Medium","Dublin Core:Bibliographic Citation","Dublin Core:Accrual Method","Dublin Core:Accrual Periodicity","Dublin Core:Accrual Policy","Dublin Core:Audience","Dublin Core:Audience Education Level","Dublin Core:Mediator","Dublin Core:Instructional Method","Dublin Core:Rights Holder","Item Type Metadata:Text","Item Type Metadata:Interviewer","Item Type Metadata:Interviewee","Item Type Metadata:Location","Item Type Metadata:Transcription","Item Type Metadata:Local URL","Item Type Metadata:Original Format","Item Type Metadata:Physical Dimensions","Item Type Metadata:Duration","Item Type Metadata:Compression","Item Type Metadata:Producer","Item Type Metadata:Director","Item Type Metadata:Bit Rate/Frequency","Item Type Metadata:Time Summary","Item Type Metadata:Email Body","Item Type Metadata:Subject Line","Item Type Metadata:From","Item Type Metadata:To","Item Type Metadata:CC","Item Type Metadata:BCC","Item Type Metadata:Number of Attachments","Item Type Metadata:Standards","Item Type Metadata:Objectives","Item Type Metadata:Materials","Item Type Metadata:Lesson Plan Text","Item Type Metadata:URL","Item Type Metadata:Event Type","Item Type Metadata:Participants","Item Type Metadata:Birth Date","Item Type Metadata:Birthplace","Item Type Metadata:Death Date","Item Type Metadata:Occupation","Item Type Metadata:Biographical Text","Item Type Metadata:Bibliography","Item Type Metadata:Player","Item Type Metadata:Imported Thumbnail","Item Type Metadata:OHMS Object","Item Type Metadata:OHMS Object Text","Item Type Metadata:Interview Keyword","Item Type Metadata:Sort Priority","PDF Text:Text",Scripto:Transcription,tags,file,itemType,collection,public,featured
65,http://libarchstor2.uah.edu/digitalcollections/items/show/65,loc_robf_000131_000154,"Official program of the Monte Sano State Park Celebration.",,"This celebration was held on the park's opening day. Events included a parade, an address given by Speaker of the U.S. House of Representatives William B. Bankhead, a history pageant, and a ""Queen's Ball"" that evening at the Russel Erskine Hotel. The program includes a description of the cabins, the ""Legend of Monte Sano,""  a history of Huntsville, and a program for the history pageant, titled ""The Parade of Progress."" ",,,1938-08-25,1930-1939,,,"Pageants^^State parks & reserves^^Monte Sano State Park (Ala.)^^Huntsville (Ala.)^^Madison County (Ala.)^^Monte Sano Mountain (Huntsville, Ala.)","Keepsakes^^Programs^^Still Image^^Text",,"Frances Roberts Collection^^Series 4, Subseries A, Box 13, Folder 32^^University of Alabama in Huntsville Archives, Special Collections, and Digital Initiatives, Huntsville, Alabama",,,,en,"This material may be protected under U. S. Copyright Law (Title 17, U.S. Code) which governs the making of photocopies or reproductions of copyrighted materials. You may use the digitized material for private study, scholarship, or research. Though the University of Alabama in Huntsville Archives and Special Collections has physical ownership of the material in its collections, in some cases we may not own the copyright to the material. It is the patron's obligation to determine and satisfy copyright restrictions when publishing or otherwise distributing materials found in our collections.",loc_robf_2018,,,,,,,,,,,,,,,,,,,,,,,,,,,,,,,,,,,,,,,,,,,,,,,,,,,,,,,,,,,,,,,,,,,,,,,,,,,,,,,http://libarchstor2.uah.edu/digitalcollections/files/original/5/65/loc_robf_131_154_webA.pdf,,"Frances Cabaniss Roberts Collection (Rescans)",1,0
120,http://libarchstor2.uah.edu/digitalcollections/items/show/120,pol_jonr_000001_000004,"Materials from Rep. Bob Jones' visit to Keesler Air Force Base in Biloxi, Mississippi after Hurricane Camille.",,"The materials include correspondence between Jones and Major General T. E. Moore, commander of the Keesler Technical Training Center, and a photo of Jones with Moore, Congressman William Colmer of Mississippi and General Sam Maddux.","Jones, Robert Emmett, 1912-1997",,1969-08-23,1960-1969,,,"Colmer, William Meyers, 1890-1980^^Jones, Robert Emmett, 1912-1997^^Maddux, Sam, 1914-1990^^Moore, Thomas E. (Thomas Estes), 1912-2007^^Hurricane Camille, 1969^^Keesler Air Force Base (Miss.)","Correspondence^^Photographs^^Still Image^^Text",,"Robert E. (Bob) Jones Collection^^University of Alabama in Huntsville Archives, Special Collections, and Digital Initiatives, Huntsville, Alabama",,,,en,"This material may be protected under U. S. Copyright Law (Title 17, U.S. Code) which governs the making of photocopies or reproductions of copyrighted materials. You may use the digitized material for private study, scholarship, or research. Though the University of Alabama in Huntsville Archives and Special Collections has physical ownership of the material in its collections, in some cases we may not own the copyright to the material. It is the patron's obligation to determine and satisfy copyright restrictions when publishing or otherwise distributing materials found in our collections.",,,,,,,,,,,,,,,,,,,,,,,,,,,,,,,,,,,,,,,,,,,,,,,,,,,,,,,,,,,,,,,,,,,,,,,,,,,,,,,,http://libarchstor2.uah.edu/digitalcollections/files/original/10/120/pol_jonb_001_004A.pdf,,"Robert E. (Bob) Jones Collection",1,0
453,http://libarchstor2.uah.edu/digitalcollections/items/show/453,uah_lone_000001,"Wernher and Maria von Braun at a cocktail party given for the Alabama legislature.",,"A note on the back of the photo reads, ""Cocktail Party for legislature at time Huntsville wanted Research Park & Institute for university."" From left to right: Mrs. Foster Haley, Mrs. Milton Cummings, Wernher von Braun, Maria von Braun, Roscoe Roberts, Ryan DeGraffenried, and Milton Cummings.","George C. Marshall Space Flight Center",,1961-05,1960-1969,,,"Von Braun, Maria^^Von Braun, Wernher, 1912-1977^^Alabama. Legislature^^Alabama--Politics and government^^Cocktail parties^^Huntsville (Ala.)^^Madison County (Ala.)","Photographs^^Still Image",,"Joel Lonergan Collection^^University of Alabama in Huntsville Special Collections, Huntsville, Alabama",,,,en,"This material may be protected under U. S. Copyright Law (Title 17, U.S. Code) which governs the making of photocopies or reproductions of copyrighted materials. You may use the digitized material for private study, scholarship, or research. Though the University of Alabama in Huntsville Archives and Special Collections has physical ownership of the material in its collections, in some cases we may not own the copyright to the material. It is the patron's obligation to determine and satisfy copyright restrictions when publishing or otherwise distributing materials found in our collections.",,,,,,,,,,,,,,,,,,,,,,,,,,,,,,,,,,,,,,,,,,,,,,,,,,,,,,,,,,,,,,,,,,,,,,,,,,,,,,,,http://libarchstor2.uah.edu/digitalcollections/files/original/34/453/uah_lone_0000001.pdf,,"Joel Lonergan Collection",1,0
454,http://libarchstor2.uah.edu/digitalcollections/items/show/454,uah_lone_000003,"Coal barge on the Tennessee River.",,"A note on the reverse of the photograph reads, ""Ton of coal passing Decatur on the Tennessee River.""",,,,1950-1959^^1960-1969,,,"Coal--Transportation--United States^^Tennessee River^^Decatur (Ala.)^^Morgan County (Ala.)","Photographs^^Still Image",,"Joel Lonergan Collection^^University of Alabama in Huntsville Archives, Special Collections, and Digital Initiatives, Huntsville, Alabama",,,,en,"This material may be protected under U. S. Copyright Law (Title 17, U.S. Code) which governs the making of photocopies or reproductions of copyrighted materials. You may use the digitized material for private study, scholarship, or research. Though the University of Alabama in Huntsville Archives and Special Collections has physical ownership of the material in its collections, in some cases we may not own the copyright to the material. It is the patron's obligation to determine and satisfy copyright restrictions when publishing or otherwise distributing materials found in our collections.",,,,,,,,,,,,,,,,,,,,,,,,,,,,,,,,,,,,,,,,,,,,,,,,,,,,,,,,,,,,,,,,,,,,,,,,,,,,,,,,http://libarchstor2.uah.edu/digitalcollections/files/original/34/454/uah_lone_0000003.pdf,,"Joel Lonergan Collection",1,0
455,http://libarchstor2.uah.edu/digitalcollections/items/show/455,uah_lone_000005,"Parts of a V-2 rocket on display on the west side of Courthouse Square in Huntsville, Alabama.",,"The tank on the left is labeled ""V-2 Alcohol Container,"" while the tank on the right is labeled ""V-2 Liquid Oxygen Container."" On the far right of the photo is the ""V-2 Propulsion Unit."" In the background are various businesses, including P. M. Woodfin Cotton, Anderson Clayton & Co. Cotton Buyers, and First National Bank.",,,,1950-1959^^1960-1969,,,"Propulsion systems^^V-2 rocket^^Huntsville (Ala.)^^Madison County (Ala.)","Photographs^^Still Image",,"Joel Lonergan Collection^^University of Alabama in Huntsville Archives, Special Collections, and Digital Initiatives, Huntsville, Alabama",,,,en,"This material may be protected under U. S. Copyright Law (Title 17, U.S. Code) which governs the making of photocopies or reproductions of copyrighted materials. You may use the digitized material for private study, scholarship, or research. Though the University of Alabama in Huntsville Archives and Special Collections has physical ownership of the material in its collections, in some cases we may not own the copyright to the material. It is the patron's obligation to determine and satisfy copyright restrictions when publishing or otherwise distributing materials found in our collections.",,,,,,,,,,,,,,,,,,,,,,,,,,,,,,,,,,,,,,,,,,,,,,,,,,,,,,,,,,,,,,,,,,,,,,,,,,,,,,,,http://libarchstor2.uah.edu/digitalcollections/files/original/34/455/uah_lone_0000005.pdf,,"Joel Lonergan Collection",1,0
462,http://libarchstor2.uah.edu/digitalcollections/items/show/462,spc_lund_000008,"David Christensen speaking at the dedication of the Willy Ley Collection at the UAH Library.",,"Christensen then worked in the Division of Graduate Programs and Research at UAH. The UAH Library purchased the Willy Ley Collection from Ley's widow, Olga, in 1970.","University of Alabama in Huntsville",,1971-04-16,1970-1979,,,"Christensen, David L.^^Ley, Willy, 1906-1969^^Libraries--Special collections^^Science writers^^University of Alabama in Huntsville^^Academic libraries^^Huntsville (Ala.)^^Madison County (Ala.)^^Academic libraries","Still Image^^Photographs",,"Charles A. Lundquist Collection^^Box 92^^University of Alabama in Huntsville Archives, Special Collections, and Digital Initiatives, Huntsville, Alabama",,,,en,"This material may be protected under U. S. Copyright Law (Title 17, U.S. Code) which governs the making of photocopies or reproductions of copyrighted materials. You may use the digitized material for private study, scholarship, or research. Though the University of Alabama in Huntsville Archives and Special Collections has physical ownership of the material in its collections, in some cases we may not own the copyright to the material. It is the patron's obligation to determine and satisfy copyright restrictions when publishing or otherwise distributing materials found in our collections.",spc_lund_2019_01,,,,,,,,,,,,,,,,,,,,,,,,,,,,,,,,,,,,,,,,,,,,,,,,,,,,,,,,,,,,,,,,,,,,,,,,,,,,,,,http://libarchstor2.uah.edu/digitalcollections/files/original/23/462/spc_lund_0000008.pdf,,"Charles A. Lundquist Collection",1,0
463,http://libarchstor2.uah.edu/digitalcollections/items/show/463,spc_lund_000009,"Painted sign advertising the Willy Ley Collection at the UAH Library.",,"Today this sign is on display in the Archives and Special Collections reading room on the ground floor of the library.  The UAH Library purchased the Willy Ley Collection from Ley's widow, Olga, in 1970.","University of Alabama in Huntsville",,1971-04-16,1970-1979,,,"Ley, Willy, 1906-1969^^Libraries--Special collections^^Science writers^^University of Alabama in Huntsville^^Academic libraries^^Huntsville (Ala.)^^Madison County (Ala.)^^Academic libraries","Still Image^^Photographs",,"Charles A. Lundquist Collection^^Box 92^^University of Alabama in Huntsville Archives, Special Collections, and Digital Initiatives, Huntsville, Alabama",,,,en,"This material may be protected under U. S. Copyright Law (Title 17, U.S. Code) which governs the making of photocopies or reproductions of copyrighted materials. You may use the digitized material for private study, scholarship, or research. Though the University of Alabama in Huntsville Archives and Special Collections has physical ownership of the material in its collections, in some cases we may not own the copyright to the material. It is the patron's obligation to determine and satisfy copyright restrictions when publishing or otherwise distributing materials found in our collections.",spc_lund_2019_01,,,,,,,,,,,,,,,,,,,,,,,,,,,,,,,,,,,,,,,,,,,,,,,,,,,,,,,,,,,,,,,,,,,,,,,,,,,,,,,http://libarchstor2.uah.edu/digitalcollections/files/original/23/463/spc_lund_0000009.pdf,,"Charles A. Lundquist Collection",1,0
464,http://libarchstor2.uah.edu/digitalcollections/items/show/464,spc_lund_000010,"David Christensen speaking at the dedication of the Willy Ley Collection at the UAH Library.",,"Christensen then worked in the Division of Graduate Programs and Research at UAH. The UAH Library purchased the Willy Ley Collection from Ley's widow, Olga, in 1970.","University of Alabama in Huntsville",,1971-04-16,1970-1979,,,"Christensen, David L.^^Ley, Willy, 1906-1969^^Libraries--Special collections^^Science writers^^University of Alabama in Huntsville^^Academic libraries^^Huntsville (Ala.)^^Madison County (Ala.)^^Academic libraries","Still Image^^Photographs",,"Charles A. Lundquist Collection^^Box 92^^University of Alabama in Huntsville Archives, Special Collections, and Digital Initiatives, Huntsville, Alabama",,,,en,"This material may be protected under U. S. Copyright Law (Title 17, U.S. Code) which governs the making of photocopies or reproductions of copyrighted materials. You may use the digitized material for private study, scholarship, or research. Though the University of Alabama in Huntsville Archives and Special Collections has physical ownership of the material in its collections, in some cases we may not own the copyright to the material. It is the patron's obligation to determine and satisfy copyright restrictions when publishing or otherwise distributing materials found in our collections.",spc_lund_2019_01,,,,,,,,,,,,,,,,,,,,,,,,,,,,,,,,,,,,,,,,,,,,,,,,,,,,,,,,,,,,,,,,,,,,,,,,,,,,,,,http://libarchstor2.uah.edu/digitalcollections/files/original/23/464/spc_lund_0000010.pdf,,"Charles A. Lundquist Collection",1,0
465,http://libarchstor2.uah.edu/digitalcollections/items/show/465,spc_lund_000011,"David Christensen speaking at the dedication of the Willy Ley Collection at the UAH Library.",,"Christensen then worked in the Division of Graduate Programs and Research at UAH.  The UAH Library purchased the Willy Ley Collection from Ley's widow, Olga, in 1970.","University of Alabama in Huntsville",,1971-04-16,1970-1979,,,"Christensen, David L.^^Ley, Willy, 1906-1969^^Libraries--Special collections^^Science writers^^University of Alabama in Huntsville^^Academic libraries^^Huntsville (Ala.)^^Madison County (Ala.)^^Academic libraries","Still image^^Photographs",,"Charles A. Lundquist Collection^^Box 92^^University of Alabama in Huntsville Archives, Special Collections, and Digital Initiatives, Huntsville, Alabama",,,,en,"This material may be protected under U. S. Copyright Law (Title 17, U.S. Code) which governs the making of photocopies or reproductions of copyrighted materials. You may use the digitized material for private study, scholarship, or research. Though the University of Alabama in Huntsville Archives and Special Collections has physical ownership of the material in its collections, in some cases we may not own the copyright to the material. It is the patron's obligation to determine and satisfy copyright restrictions when publishing or otherwise distributing materials found in our collections.",spc_lund_2019_01,,,,,,,,,,,,,,,,,,,,,,,,,,,,,,,,,,,,,,,,,,,,,,,,,,,,,,,,,,,,,,,,,,,,,,,,,,,,,,,http://libarchstor2.uah.edu/digitalcollections/files/original/23/465/spc_lund_0000011.pdf,,"Charles A. Lundquist Collection",1,0
466,http://libarchstor2.uah.edu/digitalcollections/items/show/466,spc_lund_000012,"Olga Ley speaking at the dedication of the Willy Ley Collection at the UAH Library.",,"David Christensen is standing at the right. The UAH Library purchased the Willy Ley Collection from Mrs. Ley in 1970.","University of Alabama in Huntsville",,1971-04-16,1970-1979,,,"Ley, Olga, 1912-^^Ley, Willy, 1906-1969^^Libraries--Special collections^^Science writers^^University of Alabama in Huntsville^^Academic libraries^^Huntsville (Ala.)^^Madison County (Ala.)^^Academic libraries","Still image^^Photographs",,"Charles A. Lundquist Collection^^Box 92^^University of Alabama in Huntsville Archives, Special Collections, and Digital Initiatives, Huntsville, Alabama",,,,en,"This material may be protected under U. S. Copyright Law (Title 17, U.S. Code) which governs the making of photocopies or reproductions of copyrighted materials. You may use the digitized material for private study, scholarship, or research. Though the University of Alabama in Huntsville Archives and Special Collections has physical ownership of the material in its collections, in some cases we may not own the copyright to the material. It is the patron's obligation to determine and satisfy copyright restrictions when publishing or otherwise distributing materials found in our collections.",spc_lund_2019_01,,,,,,,,,,,,,,,,,,,,,,,,,,,,,,,,,,,,,,,,,,,,,,,,,,,,,,,,,,,,,,,,,,,,,,,,,,,,,,,http://libarchstor2.uah.edu/digitalcollections/files/original/23/466/spc_lund_0000012.pdf,,"Charles A. Lundquist Collection",1,0
467,http://libarchstor2.uah.edu/digitalcollections/items/show/467,spc_lund_000013,"Arthur Rudolph speaking at the dedication of the Willy Ley Collection at the UAH Library.",,"At the time, Rudolph was retired from NASA as the former manager of the Saturn V program at Marshall Space Flight Center.  The UAH Library purchased the Willy Ley Collection from Ley's widow, Olga, in 1970.","University of Alabama in Huntsville",,1971-04-16,1970-1979,,,"Ley, Willy, 1906-1969^^Rudolph, Arthur Louis Hugo, 1906-^^Libraries--Special collections^^Science writers^^University of Alabama in Huntsville^^Academic libraries^^Huntsville (Ala.)^^Madison County (Ala.)^^Academic libraries","Still image^^Photographs",,"Charles A. Lundquist Collection^^Box 92^^University of Alabama in Huntsville Archives, Special Collections, and Digital Initiatives, Huntsville, Alabama",,,,en,"This material may be protected under U. S. Copyright Law (Title 17, U.S. Code) which governs the making of photocopies or reproductions of copyrighted materials. You may use the digitized material for private study, scholarship, or research. Though the University of Alabama in Huntsville Archives and Special Collections has physical ownership of the material in its collections, in some cases we may not own the copyright to the material. It is the patron's obligation to determine and satisfy copyright restrictions when publishing or otherwise distributing materials found in our collections.",spc_lund_2019_01,,,,,,,,,,,,,,,,,,,,,,,,,,,,,,,,,,,,,,,,,,,,,,,,,,,,,,,,,,,,,,,,,,,,,,,,,,,,,,,http://libarchstor2.uah.edu/digitalcollections/files/original/23/467/spc_lund_0000013.pdf,,"Charles A. Lundquist Collection",1,0
468,http://libarchstor2.uah.edu/digitalcollections/items/show/468,spc_lund_000014,"Ben Graves speaking at the dedication of the Willy Ley Collection at the UAH Library.",,"Graves was the president of UAH at the time. David Christensen is standing at the right, next to a sign painted to advertise the collection.  The UAH Library purchased the Willy Ley Collection from Ley's widow, Olga, in 1970.","University of Alabama in Huntsville",,1971-04-16,1970-1979,,,"Graves, Benjamin Barnes^^Ley, Willy, 1906-1969^^Libraries--Special collections^^Science writers^^University of Alabama in Huntsville^^Academic libraries^^Huntsville (Ala.)^^Madison County (Ala.)^^Academic libraries","Still image^^Photographs",,"Charles A. Lundquist Collection^^Box 92^^University of Alabama in Huntsville Archives, Special Collections, and Digital Initiatives, Huntsville, Alabama",,,,en,"This material may be protected under U. S. Copyright Law (Title 17, U.S. Code) which governs the making of photocopies or reproductions of copyrighted materials. You may use the digitized material for private study, scholarship, or research. Though the University of Alabama in Huntsville Archives and Special Collections has physical ownership of the material in its collections, in some cases we may not own the copyright to the material. It is the patron's obligation to determine and satisfy copyright restrictions when publishing or otherwise distributing materials found in our collections.",spc_lund_2019_01,,,,,,,,,,,,,,,,,,,,,,,,,,,,,,,,,,,,,,,,,,,,,,,,,,,,,,,,,,,,,,,,,,,,,,,,,,,,,,,http://libarchstor2.uah.edu/digitalcollections/files/original/23/468/spc_lund_0000014.pdf,,"Charles A. Lundquist Collection",1,0
469,http://libarchstor2.uah.edu/digitalcollections/items/show/469,spc_lund_000015,"Olga Ley cutting the ribbon at the opening of the Willy Ley Collection at the UAH Library.",," The UAH Library purchased the Willy Ley Collection from Mrs. Ley in 1970.","University of Alabama in Huntsville",,1971-04-16,1970-1979,,,"Ley, Olga, 1912-^^Ley, Willy, 1906-1969^^Libraries--Special collections^^Science writers^^University of Alabama in Huntsville^^Academic libraries^^Huntsville (Ala.)^^Madison County (Ala.)^^Academic libraries","Still image^^Photographs",,"Charles A. Lundquist Collection^^Box 92^^University of Alabama in Huntsville Archives, Special Collections, and Digital Initiatives, Huntsville, Alabama",,,,en,"This material may be protected under U. S. Copyright Law (Title 17, U.S. Code) which governs the making of photocopies or reproductions of copyrighted materials. You may use the digitized material for private study, scholarship, or research. Though the University of Alabama in Huntsville Archives and Special Collections has physical ownership of the material in its collections, in some cases we may not own the copyright to the material. It is the patron's obligation to determine and satisfy copyright restrictions when publishing or otherwise distributing materials found in our collections.",spc_lund_2019_01,,,,,,,,,,,,,,,,,,,,,,,,,,,,,,,,,,,,,,,,,,,,,,,,,,,,,,,,,,,,,,,,,,,,,,,,,,,,,,,http://libarchstor2.uah.edu/digitalcollections/files/original/23/469/spc_lund_0000015.pdf,,"Charles A. Lundquist Collection",1,0