﻿"Item Id","Item URI","Dublin Core:Identifier","Dublin Core:Title","Dublin Core:Alternative Title","Dublin Core:Description","Dublin Core:Creator","Dublin Core:Publisher","Dublin Core:Date","Dublin Core:Temporal Coverage","Dublin Core:Coverage","Dublin Core:Spatial Coverage","Dublin Core:Subject","Dublin Core:Type","Dublin Core:Format","Dublin Core:Source","Dublin Core:Is Part Of","Dublin Core:Has Format","Dublin Core:Provenance","Dublin Core:Language","Dublin Core:Rights","Dublin Core:Relation","Dublin Core:Contributor","Dublin Core:Abstract","Dublin Core:Table Of Contents","Dublin Core:Date Available","Dublin Core:Date Created","Dublin Core:Date Accepted","Dublin Core:Date Copyrighted","Dublin Core:Date Submitted","Dublin Core:Date Issued","Dublin Core:Date Modified","Dublin Core:Date Valid","Dublin Core:Access Rights","Dublin Core:License","Dublin Core:Conforms To","Dublin Core:Has Part","Dublin Core:Has Version","Dublin Core:Is Format Of","Dublin Core:Is Referenced By","Dublin Core:Is Replaced By","Dublin Core:Is Required By","Dublin Core:Is Version Of","Dublin Core:References","Dublin Core:Replaces","Dublin Core:Requires","Dublin Core:Extent","Dublin Core:Medium","Dublin Core:Bibliographic Citation","Dublin Core:Accrual Method","Dublin Core:Accrual Periodicity","Dublin Core:Accrual Policy","Dublin Core:Audience","Dublin Core:Audience Education Level","Dublin Core:Mediator","Dublin Core:Instructional Method","Dublin Core:Rights Holder","Item Type Metadata:Text","Item Type Metadata:Interviewer","Item Type Metadata:Interviewee","Item Type Metadata:Location","Item Type Metadata:Transcription","Item Type Metadata:Local URL","Item Type Metadata:Original Format","Item Type Metadata:Physical Dimensions","Item Type Metadata:Duration","Item Type Metadata:Compression","Item Type Metadata:Producer","Item Type Metadata:Director","Item Type Metadata:Bit Rate/Frequency","Item Type Metadata:Time Summary","Item Type Metadata:Email Body","Item Type Metadata:Subject Line","Item Type Metadata:From","Item Type Metadata:To","Item Type Metadata:CC","Item Type Metadata:BCC","Item Type Metadata:Number of Attachments","Item Type Metadata:Standards","Item Type Metadata:Objectives","Item Type Metadata:Materials","Item Type Metadata:Lesson Plan Text","Item Type Metadata:URL","Item Type Metadata:Event Type","Item Type Metadata:Participants","Item Type Metadata:Birth Date","Item Type Metadata:Birthplace","Item Type Metadata:Death Date","Item Type Metadata:Occupation","Item Type Metadata:Biographical Text","Item Type Metadata:Bibliography","Item Type Metadata:Player","Item Type Metadata:Imported Thumbnail","Item Type Metadata:OHMS Object","Item Type Metadata:OHMS Object Text","Item Type Metadata:Interview Keyword","Item Type Metadata:Sort Priority","PDF Text:Text",Scripto:Transcription,tags,file,itemType,collection,public,featured
928,http://libarchstor2.uah.edu/digitalcollections/items/show/928,spc_stuh_000007,"Crowds and television cameras wait for President John F. Kennedy during his second visit to Huntsville.",,"Kennedy visited Huntsville on Armed Forces Day 1963. He first visited the area on September 11, 1962.","United States. National Aeronautics and Space Administration",,1963-05-18,1960-1969,,,"George C. Marshall Space Flight Center^^Redstone Arsenal (Ala.)^^Visits of state^^Huntsville (Ala.)^^Madison County (Ala.)","Photographs^^Still Image",,"Ernst Stuhlinger Collection^^Recognition Collection, Box 2, Folder 3.14^^University of Alabama in Huntsville Archives, Special Collections, and Digital Initiatives, Huntsville, Alabama",,,"This item was digitized for the Apollo 11 50th anniversary celebration.",en,"This material may be protected under U. S. Copyright Law (Title 17, U.S. Code) which governs the making of photocopies or reproductions of copyrighted materials. You may use the digitized material for private study, scholarship, or research. Though the University of Alabama in Huntsville Archives and Special Collections has physical ownership of the material in its collections, in some cases we may not own the copyright to the material. It is the patron's obligation to determine and satisfy copyright restrictions when publishing or otherwise distributing materials found in our collections.",ap11_exhibit_2019_08,,,,,,,,,,,,,,,,,,,,,,,,,,,,,,,,,,,,,,,,,,,,,,,,,,,,,,,,,,,,,,,,,,,,,,,,,,,,,,,http://libarchstor2.uah.edu/digitalcollections/files/original/19/928/spc_stuh_000007.pdf,,"Ernst Stuhlinger Collection",1,0
6737,http://libarchstor2.uah.edu/digitalcollections/items/show/6737,spc_tess_000021,"Crowd gathers at the Redstone Test Stand.",,"The Alabama chapter of the American Society of Civil Engineers awarded landmark status to the Redstone Test Stand in 1979.","Tessmann, Bernhard",,1979,1970-1979,,,"Test stands^^Redstone Arsenal (Ala.)^^Huntsville (Ala.)^^Madison County (Ala.)","Photographs^^Still Image",,"Bernhard Tessmann Collection^^Box 1, Folder 8^^en^^University of Alabama in Huntsville Archives, Special Collections, and Digital Initiatives, Huntsville, Alabama",,,,en,"This material may be protected under U. S. Copyright Law (Title 17, U.S. Code) which governs the making of photocopies or reproductions of copyrighted materials. You may use the digitized material for private study, scholarship, or research. Though the University of Alabama in Huntsville Archives and Special Collections has physical ownership of the material in its collections, in some cases we may not own the copyright to the material. It is the patron's obligation to determine and satisfy copyright restrictions when publishing or otherwise distributing materials found in our collections.",spc_coll_2021_09_01,,,,,,,,,,,,,,,,,,,,,,,,,,,,,,,,,,,,,,,,,,,,,,,,,,,,,,,,,,,,,,,,,,,,,,,,,,,,,,,http://libarchstor2.uah.edu/digitalcollections/files/original/3/6737/spc_tess_0000021_web.pdf,,"Bernhard Tessmann Collection",1,0
38,http://libarchstor2.uah.edu/digitalcollections/items/show/38,loc_mshc_000027,"Crowd gathered at the capitol building in Denver, Colorado.",,"A handwritten inscription on the back of the photo notes, ""The day 'our soldiers' came home, in front of capital. Sept. '99.""",,,1899,1890-1899,,,"Colorado State Capitol (Denver, Colo.)^^Soldiers--United States","Card photographs^^Still Image",,"Monte Sano Historical Collection^^Box 4, Folder 30^^University of Alabama in Huntsville Archives, Special Collections, and Digital Initiatives, Huntsville, Alabama",,,,en,"This material may be protected under U. S. Copyright Law (Title 17, U.S. Code) which governs the making of photocopies or reproductions of copyrighted materials. You may use the digitized material for private study, scholarship, or research. Though the University of Alabama in Huntsville Archives and Special Collections has physical ownership of the material in its collections, in some cases we may not own the copyright to the material. It is the patron's obligation to determine and satisfy copyright restrictions when publishing or otherwise distributing materials found in our collections.",loc_mshc_2018,,,,,,,,,,,,,,,,,,,,,,,,,,,,,,,,,,,,,,,,,,,,,,,,,,,,,,,,,,,,,,,,,,,,,,,,,,,,,,,http://libarchstor2.uah.edu/digitalcollections/files/original/7/38/loc_mshc_0000027_web.pdf,,"Jane Barr Monte Sano Historical Collection",1,0
3855,http://libarchstor2.uah.edu/digitalcollections/items/show/3855,loc_burw_000621,"Courtyard of Villa - Venafro.",,"Photograph number 401. This photograph shows people and a horse cart in the courtyard of a villa in Venafro, Italy. The title for this image was found in Major Edwin D. Burwell Jr.'s  list of photographs.","Burwell, Edwin D. III [Burwell, Edwin D., Jr.]",,1944,1940-1949,,,"Carriages and carts^^Venafro (Italy)^^World War, 1939-1945","Photographs^^Still Image",,"Burwell Family Collection^^University of Alabama in Huntsville Archives, Special Collections, and Digital Initiatives, Huntsville, Alabama",,,,en,"This material may be protected under U. S. Copyright Law (Title 17, U.S. Code) which governs the making of photocopies or reproductions of copyrighted materials. You may use the digitized material for private study, scholarship, or research. Though the University of Alabama in Huntsville Archives and Special Collections has physical ownership of the material in its collections, in some cases we may not own the copyright to the material. It is the patron's obligation to determine and satisfy copyright restrictions when publishing or otherwise distributing materials found in our collections.",loc_burw_2021_03B,,,,,,,,,,,,,,,,,,,,,,,,,,,,,,,,,,,,,,,,,,,,,,,,,,,,,,,,,,,,,,,,,,,,,,,,,,,,,,,http://libarchstor2.uah.edu/digitalcollections/files/original/76/3855/Loc_burw-621.pdf,,"Burwell Family Collection",1,0
1030,http://libarchstor2.uah.edu/digitalcollections/items/show/1030,uah_uahp_000378,"Couple at the 1987 Homecoming reception.",,,"University of Alabama in Huntsville",,1987,1980-1989,,,"College students^^Student activities^^University of Alabama in Huntsville^^Huntsville (Ala.)^^Madison County (Ala.)","Photographs^^Still Image","Film negatives","UAH Photograph Collection^^University of Alabama in Huntsville Archives, Special Collections, and Digital Initiatives, Huntsville, Alabama",,,,en,"This material may be protected under U. S. Copyright Law (Title 17, U.S. Code) which governs the making of photocopies or reproductions of copyrighted materials. You may use the digitized material for private study, scholarship, or research. Though the University of Alabama in Huntsville Archives and Special Collections has physical ownership of the material in its collections, in some cases we may not own the copyright to the material. It is the patron's obligation to determine and satisfy copyright restrictions when publishing or otherwise distributing materials found in our collections.",uah_photos_2019_10,,,,,,,,,,,,,,,,,,,,,,,,,,,,,,,,,,,,,,,,,,,,,,,,,,,,,,,,,,,,,,,,,,,,,,,,,,,,,,,http://libarchstor2.uah.edu/digitalcollections/files/original/40/1030/uah_uahp_000378.pdf,,"UAH Photograph Collection",1,0
4494,http://libarchstor2.uah.edu/digitalcollections/items/show/4494,loc_hutc_000032_000032,"Copy photograph of Thomas Cushing Barclay, Margaret Barclay Troy, and Anna Barclay Newman.",,"On back: ""Thomas Cushing Barclay 1818-1886 / Margaret Barclay Troy / Anna Barclay Newman""",,,,,,,"Family^^Photography^^Huntsville (Ala.)^^Madison County (Ala.)","Photographs^^Still Image",,"Eleanor Hutchens Collection^^Box 3, Folder Album^^University of Alabama in Huntsville Archives, Special Collections, and Digital Initiatives, Huntsville, Alabama",,,,en,"This material may be protected under U. S. Copyright Law (Title 17, U.S. Code) which governs the making of photocopies or reproductions of copyrighted materials. You may use the digitized material for private study, scholarship, or research. Though the University of Alabama in Huntsville Archives and Special Collections has physical ownership of the material in its collections, in some cases we may not own the copyright to the material. It is the patron's obligation to determine and satisfy copyright restrictions when publishing or otherwise distributing materials found in our collections.",loc_hutc_2021_04,,,,,,,,,,,,,,,,,,,,,,,,,,,,,,,,,,,,,,,,,,,,,,,,,,,,,,,,,,,,,,,,,,,,,,,,,,,,,,,http://libarchstor2.uah.edu/digitalcollections/files/original/36/4494/loc_hutc_000032_000032.pdf,,"Eleanor Hutchens Collection",1,0
4499,http://libarchstor2.uah.edu/digitalcollections/items/show/4499,loc_hutc_000037_000037,"Copy photograph of the Barclay family.",,"On back: ""Mostly Barclays at the Newman house on Adams""",,,,,,,"Family^^Photography^^Huntsville (Ala.)^^Madison County (Ala.)","Photographs^^Still Image",,"Eleanor Hutchens Collection^^Box 3, Folder Album^^University of Alabama in Huntsville Archives, Special Collections, and Digital Initiatives, Huntsville, Alabama",,,,en,"This material may be protected under U. S. Copyright Law (Title 17, U.S. Code) which governs the making of photocopies or reproductions of copyrighted materials. You may use the digitized material for private study, scholarship, or research. Though the University of Alabama in Huntsville Archives and Special Collections has physical ownership of the material in its collections, in some cases we may not own the copyright to the material. It is the patron's obligation to determine and satisfy copyright restrictions when publishing or otherwise distributing materials found in our collections.",loc_hutc_2021_04,,,,,,,,,,,,,,,,,,,,,,,,,,,,,,,,,,,,,,,,,,,,,,,,,,,,,,,,,,,,,,,,,,,,,,,,,,,,,,,http://libarchstor2.uah.edu/digitalcollections/files/original/36/4499/loc_hutc_000037_000037.pdf,,"Eleanor Hutchens Collection",1,0
4497,http://libarchstor2.uah.edu/digitalcollections/items/show/4497,loc_hutc_000035_000035,"Copy photograph of John W. Barclay.",,"On back: ""Dr. John W. Barclay""",,,,,,,"Photography^^Huntsville (Ala.)^^Madison County (Ala.)","Photographs^^Still Image",,"Eleanor Hutchens Collection^^Box 3, Folder Album^^University of Alabama in Huntsville Archives, Special Collections, and Digital Initiatives, Huntsville, Alabama",,,,en,"This material may be protected under U. S. Copyright Law (Title 17, U.S. Code) which governs the making of photocopies or reproductions of copyrighted materials. You may use the digitized material for private study, scholarship, or research. Though the University of Alabama in Huntsville Archives and Special Collections has physical ownership of the material in its collections, in some cases we may not own the copyright to the material. It is the patron's obligation to determine and satisfy copyright restrictions when publishing or otherwise distributing materials found in our collections.",loc_hutc_2021_04,,,,,,,,,,,,,,,,,,,,,,,,,,,,,,,,,,,,,,,,,,,,,,,,,,,,,,,,,,,,,,,,,,,,,,,,,,,,,,,http://libarchstor2.uah.edu/digitalcollections/files/original/36/4497/loc_hutc_000035_000035.pdf,,"Eleanor Hutchens Collection",1,0
4496,http://libarchstor2.uah.edu/digitalcollections/items/show/4496,loc_hutc_000034_000034,"Copy photograph of James Robert Barclay, Sr.",,"On back: ""James Robert Barclay Sr.""",,,,,,,"Photography^^Huntsville (Ala.)^^Madison County (Ala.)","Photographs^^Still Image",,"Eleanor Hutchens Collection^^Box 3, Folder Album^^University of Alabama in Huntsville Archives, Special Collections, and Digital Initiatives, Huntsville, Alabama",,,,en,"This material may be protected under U. S. Copyright Law (Title 17, U.S. Code) which governs the making of photocopies or reproductions of copyrighted materials. You may use the digitized material for private study, scholarship, or research. Though the University of Alabama in Huntsville Archives and Special Collections has physical ownership of the material in its collections, in some cases we may not own the copyright to the material. It is the patron's obligation to determine and satisfy copyright restrictions when publishing or otherwise distributing materials found in our collections.",loc_hutc_2021_04,,,,,,,,,,,,,,,,,,,,,,,,,,,,,,,,,,,,,,,,,,,,,,,,,,,,,,,,,,,,,,,,,,,,,,,,,,,,,,,http://libarchstor2.uah.edu/digitalcollections/files/original/36/4496/loc_hutc_000034_000034.pdf,,"Eleanor Hutchens Collection",1,0
4498,http://libarchstor2.uah.edu/digitalcollections/items/show/4498,loc_hutc_000036_000036,"Copy photograph of Bessie Lee Barclay Fuqua and Marjorie Lee Fuqua.",,"Notes on back indicate that Bessie was the daughter of James Robert Barclay Sr. and Elizabeth Ingram. ""Marjorie Lee Fuqua b. Mar. 1, 1910 / picture c. 1912"". Also notes ""Highway 72 Blue Water Creek""",,,"1912 circa",1910-1919,,,"Family^^Photography^^Huntsville (Ala.)^^Madison County (Ala.)","Photographs^^Still Image",,"Eleanor Hutchens Collection^^Box 3, Folder Album^^University of Alabama in Huntsville Archives, Special Collections, and Digital Initiatives, Huntsville, Alabama",,,,en,"This material may be protected under U. S. Copyright Law (Title 17, U.S. Code) which governs the making of photocopies or reproductions of copyrighted materials. You may use the digitized material for private study, scholarship, or research. Though the University of Alabama in Huntsville Archives and Special Collections has physical ownership of the material in its collections, in some cases we may not own the copyright to the material. It is the patron's obligation to determine and satisfy copyright restrictions when publishing or otherwise distributing materials found in our collections.",loc_hutc_2021_04,,,,,,,,,,,,,,,,,,,,,,,,,,,,,,,,,,,,,,,,,,,,,,,,,,,,,,,,,,,,,,,,,,,,,,,,,,,,,,,http://libarchstor2.uah.edu/digitalcollections/files/original/36/4498/loc_hutc_000036_000036.pdf,,"Eleanor Hutchens Collection",1,0
3435,http://libarchstor2.uah.edu/digitalcollections/items/show/3435,loc_burw_000285,"Convey from Oran to Naples.",,"Photograph number 68. This photograph shows the ship convey from Oran, Algeria to Naples, Italy. The title for this image was found in Major Edwin D. Burwell Jr.'s  list of photographs.","Burwell, Edwin D. III [Burwell, Edwin D., Jr.]",,1943,1940-1949,,,"Ocean travel^^World War, 1939-1945^^Naples (Italy)^^Oran (Algeria)","Photographs^^Still Image",,"Burwell Family Collection^^University of Alabama in Huntsville Archives, Special Collections, and Digital Initiatives, Huntsville, Alabama",,,,en,"This material may be protected under U. S. Copyright Law (Title 17, U.S. Code) which governs the making of photocopies or reproductions of copyrighted materials. You may use the digitized material for private study, scholarship, or research. Though the University of Alabama in Huntsville Archives and Special Collections has physical ownership of the material in its collections, in some cases we may not own the copyright to the material. It is the patron's obligation to determine and satisfy copyright restrictions when publishing or otherwise distributing materials found in our collections.",loc_burw_2021_03,,,,,,,,,,,,,,,,,,,,,,,,,,,,,,,,,,,,,,,,,,,,,,,,,,,,,,,,,,,,,,,,,,,,,,,,,,,,,,,http://libarchstor2.uah.edu/digitalcollections/files/original/76/3435/Loc_burw-285.pdf,,"Burwell Family Collection",1,0
3436,http://libarchstor2.uah.edu/digitalcollections/items/show/3436,loc_burw_000286,"Convey from Oran to Naples.",,"Photograph number 69. This photograph shows the ship convey from Oran, Algeria to Naples, Italy. The title for this image was found in Major Edwin D. Burwell Jr.'s  list of photographs.","Burwell, Edwin D. III [Burwell, Edwin D., Jr.]",,1943,1940-1949,,,"Ocean travel^^World War, 1939-1945^^Naples (Italy)^^Oran (Algeria)","Photographs^^Still Image",,"Burwell Family Collection^^University of Alabama in Huntsville Archives, Special Collections, and Digital Initiatives, Huntsville, Alabama",,,,en,"This material may be protected under U. S. Copyright Law (Title 17, U.S. Code) which governs the making of photocopies or reproductions of copyrighted materials. You may use the digitized material for private study, scholarship, or research. Though the University of Alabama in Huntsville Archives and Special Collections has physical ownership of the material in its collections, in some cases we may not own the copyright to the material. It is the patron's obligation to determine and satisfy copyright restrictions when publishing or otherwise distributing materials found in our collections.",loc_burw_2021_03,,,,,,,,,,,,,,,,,,,,,,,,,,,,,,,,,,,,,,,,,,,,,,,,,,,,,,,,,,,,,,,,,,,,,,,,,,,,,,,http://libarchstor2.uah.edu/digitalcollections/files/original/76/3436/Loc_burw-286.pdf,,"Burwell Family Collection",1,0
3437,http://libarchstor2.uah.edu/digitalcollections/items/show/3437,loc_burw_000287,"Convey from Oran to Naples.",,"Photograph number 70. This photograph shows the ship convey from Oran, Algeria to Naples, Italy. The title for this image was found in Major Edwin D. Burwell Jr.'s  list of photographs.","Burwell, Edwin D. III [Burwell, Edwin D., Jr.]",,1943,1940-1949,,,"Ocean travel^^World War, 1939-1945^^Naples (Italy)^^Oran (Algeria)","Photographs^^Still Image",,"Burwell Family Collection^^University of Alabama in Huntsville Archives, Special Collections, and Digital Initiatives, Huntsville, Alabama",,,,en,"This material may be protected under U. S. Copyright Law (Title 17, U.S. Code) which governs the making of photocopies or reproductions of copyrighted materials. You may use the digitized material for private study, scholarship, or research. Though the University of Alabama in Huntsville Archives and Special Collections has physical ownership of the material in its collections, in some cases we may not own the copyright to the material. It is the patron's obligation to determine and satisfy copyright restrictions when publishing or otherwise distributing materials found in our collections.",loc_burw_2021_03,,,,,,,,,,,,,,,,,,,,,,,,,,,,,,,,,,,,,,,,,,,,,,,,,,,,,,,,,,,,,,,,,,,,,,,,,,,,,,,http://libarchstor2.uah.edu/digitalcollections/files/original/76/3437/Loc_burw-287.pdf,,"Burwell Family Collection",1,0
3438,http://libarchstor2.uah.edu/digitalcollections/items/show/3438,loc_burw_000288,"Convey from Oran to Naples.",,"Photograph number 71. This photograph shows the ship convey from Oran, Algeria to Naples, Italy. The title for this image was found in Major Edwin D. Burwell Jr.'s  list of photographs.","Burwell, Edwin D. III [Burwell, Edwin D., Jr.]",,1943,1940-1949,,,"Ocean travel^^World War, 1939-1945^^Naples (Italy)^^Oran (Algeria)","Photographs^^Still Image",,"Burwell Family Collection^^University of Alabama in Huntsville Archives, Special Collections, and Digital Initiatives, Huntsville, Alabama",,,,en,"This material may be protected under U. S. Copyright Law (Title 17, U.S. Code) which governs the making of photocopies or reproductions of copyrighted materials. You may use the digitized material for private study, scholarship, or research. Though the University of Alabama in Huntsville Archives and Special Collections has physical ownership of the material in its collections, in some cases we may not own the copyright to the material. It is the patron's obligation to determine and satisfy copyright restrictions when publishing or otherwise distributing materials found in our collections.",loc_burw_2021_03,,,,,,,,,,,,,,,,,,,,,,,,,,,,,,,,,,,,,,,,,,,,,,,,,,,,,,,,,,,,,,,,,,,,,,,,,,,,,,,http://libarchstor2.uah.edu/digitalcollections/files/original/76/3438/Loc_burw-288.pdf,,"Burwell Family Collection",1,0
3439,http://libarchstor2.uah.edu/digitalcollections/items/show/3439,loc_burw_000289,"Convey from Oran to Naples.",,"Photograph number 72. This photograph shows the ship convey from Oran, Algeria to Naples, Italy. The title for this image was found in Major Edwin D. Burwell Jr.'s  list of photographs.","Burwell, Edwin D. III [Burwell, Edwin D., Jr.]",,1943,1940-1949,,,"Ocean travel^^World War, 1939-1945^^Naples (Italy)^^Oran (Algeria)","Photographs^^Still Image",,"Burwell Family Collection^^University of Alabama in Huntsville Archives, Special Collections, and Digital Initiatives, Huntsville, Alabama",,,,en,"This material may be protected under U. S. Copyright Law (Title 17, U.S. Code) which governs the making of photocopies or reproductions of copyrighted materials. You may use the digitized material for private study, scholarship, or research. Though the University of Alabama in Huntsville Archives and Special Collections has physical ownership of the material in its collections, in some cases we may not own the copyright to the material. It is the patron's obligation to determine and satisfy copyright restrictions when publishing or otherwise distributing materials found in our collections.",loc_burw_2021_03,,,,,,,,,,,,,,,,,,,,,,,,,,,,,,,,,,,,,,,,,,,,,,,,,,,,,,,,,,,,,,,,,,,,,,,,,,,,,,,http://libarchstor2.uah.edu/digitalcollections/files/original/76/3439/Loc_burw-289.pdf,,"Burwell Family Collection",1,0