﻿"Item Id","Item URI","Dublin Core:Identifier","Dublin Core:Title","Dublin Core:Alternative Title","Dublin Core:Description","Dublin Core:Creator","Dublin Core:Publisher","Dublin Core:Date","Dublin Core:Temporal Coverage","Dublin Core:Coverage","Dublin Core:Spatial Coverage","Dublin Core:Subject","Dublin Core:Type","Dublin Core:Format","Dublin Core:Source","Dublin Core:Is Part Of","Dublin Core:Has Format","Dublin Core:Provenance","Dublin Core:Language","Dublin Core:Rights","Dublin Core:Relation","Dublin Core:Contributor","Dublin Core:Abstract","Dublin Core:Table Of Contents","Dublin Core:Date Available","Dublin Core:Date Created","Dublin Core:Date Accepted","Dublin Core:Date Copyrighted","Dublin Core:Date Submitted","Dublin Core:Date Issued","Dublin Core:Date Modified","Dublin Core:Date Valid","Dublin Core:Access Rights","Dublin Core:License","Dublin Core:Conforms To","Dublin Core:Has Part","Dublin Core:Has Version","Dublin Core:Is Format Of","Dublin Core:Is Referenced By","Dublin Core:Is Replaced By","Dublin Core:Is Required By","Dublin Core:Is Version Of","Dublin Core:References","Dublin Core:Replaces","Dublin Core:Requires","Dublin Core:Extent","Dublin Core:Medium","Dublin Core:Bibliographic Citation","Dublin Core:Accrual Method","Dublin Core:Accrual Periodicity","Dublin Core:Accrual Policy","Dublin Core:Audience","Dublin Core:Audience Education Level","Dublin Core:Mediator","Dublin Core:Instructional Method","Dublin Core:Rights Holder","Item Type Metadata:Text","Item Type Metadata:Interviewer","Item Type Metadata:Interviewee","Item Type Metadata:Location","Item Type Metadata:Transcription","Item Type Metadata:Local URL","Item Type Metadata:Original Format","Item Type Metadata:Physical Dimensions","Item Type Metadata:Duration","Item Type Metadata:Compression","Item Type Metadata:Producer","Item Type Metadata:Director","Item Type Metadata:Bit Rate/Frequency","Item Type Metadata:Time Summary","Item Type Metadata:Email Body","Item Type Metadata:Subject Line","Item Type Metadata:From","Item Type Metadata:To","Item Type Metadata:CC","Item Type Metadata:BCC","Item Type Metadata:Number of Attachments","Item Type Metadata:Standards","Item Type Metadata:Objectives","Item Type Metadata:Materials","Item Type Metadata:Lesson Plan Text","Item Type Metadata:URL","Item Type Metadata:Event Type","Item Type Metadata:Participants","Item Type Metadata:Birth Date","Item Type Metadata:Birthplace","Item Type Metadata:Death Date","Item Type Metadata:Occupation","Item Type Metadata:Biographical Text","Item Type Metadata:Bibliography","Item Type Metadata:Player","Item Type Metadata:Imported Thumbnail","Item Type Metadata:OHMS Object","Item Type Metadata:OHMS Object Text","Item Type Metadata:Interview Keyword","Item Type Metadata:Sort Priority","PDF Text:Text",Scripto:Transcription,tags,file,itemType,collection,public,featured
4461,http://libarchstor2.uah.edu/digitalcollections/items/show/4461,loc_burw_001013,"Photograph of a nurse tending to the balcony windowboxes at the 300th General Hospital in Naples, Italy.",,,"Burwell, Edwin D. III [Burwell, Edwin D., Jr.]",,1944-03,1940-1949,,,"300th General Hospital (United States. Army)^^United States--Armed Forces--Medical care^^Flowers^^Gardening^^World War, 1939-1945--Campaigns--Italy^^World War, 1939-1945--Military personnel^^Naples (Italy)","Photographs^^Still Image",,"Burwell Family Collection^^University of Alabama in Huntsville Archives, Special Collections, and Digital Initiatives, Huntsville, Alabama",,,,en,"This material may be protected under U. S. Copyright Law (Title 17, U.S. Code) which governs the making of photocopies or reproductions of copyrighted materials. You may use the digitized material for private study, scholarship, or research. Though the University of Alabama in Huntsville Archives and Special Collections has physical ownership of the material in its collections, in some cases we may not own the copyright to the material. It is the patron's obligation to determine and satisfy copyright restrictions when publishing or otherwise distributing materials found in our collections.",loc_burw_2021_04D,,,,,,,,,,,,,,,,,,,,,,,,,,,,,,,,,,,,,,,,,,,,,,,,,,,,,,,,,,,,,,,,,,,,,,,,,,,,,,,http://libarchstor2.uah.edu/digitalcollections/files/original/76/4461/Loc_burw-1013.pdf,,"Burwell Family Collection",1,0
4442,http://libarchstor2.uah.edu/digitalcollections/items/show/4442,loc_burw_000994,"Photograph of a nurse taking care of a patient at the 300th General Hospital in Naples, Italy.",,,"Burwell, Edwin D. III [Burwell, Edwin D., Jr.]",,1944-03,1940-1949,,,"300th General Hospital (United States. Army)^^United States--Armed Forces--Medical care^^World War, 1939-1945--Campaigns--Italy^^World War, 1939-1945--Military personnel^^Naples (Italy)","Photographs^^Still Image",,"Burwell Family Collection^^University of Alabama in Huntsville Archives, Special Collections, and Digital Initiatives, Huntsville, Alabama",,,,en,"This material may be protected under U. S. Copyright Law (Title 17, U.S. Code) which governs the making of photocopies or reproductions of copyrighted materials. You may use the digitized material for private study, scholarship, or research. Though the University of Alabama in Huntsville Archives and Special Collections has physical ownership of the material in its collections, in some cases we may not own the copyright to the material. It is the patron's obligation to determine and satisfy copyright restrictions when publishing or otherwise distributing materials found in our collections.",loc_burw_2021_04D,,,,,,,,,,,,,,,,,,,,,,,,,,,,,,,,,,,,,,,,,,,,,,,,,,,,,,,,,,,,,,,,,,,,,,,,,,,,,,,http://libarchstor2.uah.edu/digitalcollections/files/original/76/4442/Loc_burw-994.pdf,,"Burwell Family Collection",1,0
4443,http://libarchstor2.uah.edu/digitalcollections/items/show/4443,loc_burw_000995,"Photograph of a nurse taking care of a patient at the 300th General Hospital in Naples, Italy.",,,"Burwell, Edwin D. III [Burwell, Edwin D., Jr.]",,1944-03,1940-1949,,,"300th General Hospital (United States. Army)^^United States--Armed Forces--Medical care^^World War, 1939-1945--Campaigns--Italy^^World War, 1939-1945--Military personnel^^Naples (Italy)","Photographs^^Still Image",,"Burwell Family Collection^^University of Alabama in Huntsville Archives, Special Collections, and Digital Initiatives, Huntsville, Alabama",,,,en,"This material may be protected under U. S. Copyright Law (Title 17, U.S. Code) which governs the making of photocopies or reproductions of copyrighted materials. You may use the digitized material for private study, scholarship, or research. Though the University of Alabama in Huntsville Archives and Special Collections has physical ownership of the material in its collections, in some cases we may not own the copyright to the material. It is the patron's obligation to determine and satisfy copyright restrictions when publishing or otherwise distributing materials found in our collections.",loc_burw_2021_04D,,,,,,,,,,,,,,,,,,,,,,,,,,,,,,,,,,,,,,,,,,,,,,,,,,,,,,,,,,,,,,,,,,,,,,,,,,,,,,,http://libarchstor2.uah.edu/digitalcollections/files/original/76/4443/Loc_burw-995.pdf,,"Burwell Family Collection",1,0
4341,http://libarchstor2.uah.edu/digitalcollections/items/show/4341,loc_burw_000893,"Photograph of a nurse sitting at a bedside in the 300th General Hospital in Naples, Italy.",,,"Burwell, Edwin D. III [Burwell, Edwin D., Jr.]",,1944-02,1940-1949,,,"300th General Hospital (United States. Army)^^United States--Armed Forces--Medical care^^World War, 1939-1945--Campaigns--Italy^^Naples (Italy)","Photographs^^Still Image",,"Burwell Family Collection^^University of Alabama in Huntsville Archives, Special Collections, and Digital Initiatives, Huntsville, Alabama",,,,en,"This material may be protected under U. S. Copyright Law (Title 17, U.S. Code) which governs the making of photocopies or reproductions of copyrighted materials. You may use the digitized material for private study, scholarship, or research. Though the University of Alabama in Huntsville Archives and Special Collections has physical ownership of the material in its collections, in some cases we may not own the copyright to the material. It is the patron's obligation to determine and satisfy copyright restrictions when publishing or otherwise distributing materials found in our collections.",loc_burw_2021_04B,,,,,,,,,,,,,,,,,,,,,,,,,,,,,,,,,,,,,,,,,,,,,,,,,,,,,,,,,,,,,,,,,,,,,,,,,,,,,,,http://libarchstor2.uah.edu/digitalcollections/files/original/76/4341/loc_burw-_-893.pdf,,"Burwell Family Collection",1,0
4078,http://libarchstor2.uah.edu/digitalcollections/items/show/4078,loc_burw_000844,"Photograph of a nurse outside of the 95th Evacuation Hospital Building.",,,"Burwell, Edwin D. III [Burwell, Edwin D., Jr.]",,1944-02,1940-1949,,,"United States. Army. Evacuation Hospital, 95th^^United States--Armed Forces--Medical care^^World War, 1939-1945--Campaigns--Italy^^World War, 1939-1945--Military personnel","Photographs^^Still Image",,"Burwell Family Collection^^University of Alabama in Huntsville Archives, Special Collections, and Digital Initiatives, Huntsville, Alabama",,,,en,"This material may be protected under U. S. Copyright Law (Title 17, U.S. Code) which governs the making of photocopies or reproductions of copyrighted materials. You may use the digitized material for private study, scholarship, or research. Though the University of Alabama in Huntsville Archives and Special Collections has physical ownership of the material in its collections, in some cases we may not own the copyright to the material. It is the patron's obligation to determine and satisfy copyright restrictions when publishing or otherwise distributing materials found in our collections.",loc_burw_2021_04A,,,,,,,,,,,,,,,,,,,,,,,,,,,,,,,,,,,,,,,,,,,,,,,,,,,,,,,,,,,,,,,,,,,,,,,,,,,,,,,http://libarchstor2.uah.edu/digitalcollections/files/original/76/4078/loc_burw-_-844.pdf,,"Burwell Family Collection",1,0
4091,http://libarchstor2.uah.edu/digitalcollections/items/show/4091,loc_burw_000857,"Photograph of a nurse outside of the 95th Evacuation Hospital Building.",,"The nurse is holding a blanket or cloth of some sort.","Burwell, Edwin D. III [Burwell, Edwin D., Jr.]",,1944-02,1940-1949,,,"United States. Army. Evacuation Hospital, 95th^^United States--Armed Forces--Medical care^^World War, 1939-1945--Campaigns--Italy^^World War, 1939-1945--Military personnel","Photographs^^Still Image",,"Burwell Family Collection^^University of Alabama in Huntsville Archives, Special Collections, and Digital Initiatives, Huntsville, Alabama",,,,en,"This material may be protected under U. S. Copyright Law (Title 17, U.S. Code) which governs the making of photocopies or reproductions of copyrighted materials. You may use the digitized material for private study, scholarship, or research. Though the University of Alabama in Huntsville Archives and Special Collections has physical ownership of the material in its collections, in some cases we may not own the copyright to the material. It is the patron's obligation to determine and satisfy copyright restrictions when publishing or otherwise distributing materials found in our collections.",loc_burw_2021_04A,,,,,,,,,,,,,,,,,,,,,,,,,,,,,,,,,,,,,,,,,,,,,,,,,,,,,,,,,,,,,,,,,,,,,,,,,,,,,,,http://libarchstor2.uah.edu/digitalcollections/files/original/76/4091/loc_burw-_-857.pdf,,"Burwell Family Collection",1,0
4625,http://libarchstor2.uah.edu/digitalcollections/items/show/4625,loc_burw_001037,"Photograph of a nurse outside in Italy.",,,"Burwell, Edwin D. III [Burwell, Edwin D., Jr.]",,1944-03,1940-1949,,,"United States--Armed Forces--Medical care^^War work--Red Cross^^World War, 1939-1945--Campaigns--Italy^^World War, 1939-1945--Military personnel","Photographs^^Still Image",,"Burwell Family Collection^^University of Alabama in Huntsville Archives, Special Collections, and Digital Initiatives, Huntsville, Alabama",,,,en,"This material may be protected under U. S. Copyright Law (Title 17, U.S. Code) which governs the making of photocopies or reproductions of copyrighted materials. You may use the digitized material for private study, scholarship, or research. Though the University of Alabama in Huntsville Archives and Special Collections has physical ownership of the material in its collections, in some cases we may not own the copyright to the material. It is the patron's obligation to determine and satisfy copyright restrictions when publishing or otherwise distributing materials found in our collections.",loc_burw_2021_04E,,,,,,,,,,,,,,,,,,,,,,,,,,,,,,,,,,,,,,,,,,,,,,,,,,,,,,,,,,,,,,,,,,,,,,,,,,,,,,,http://libarchstor2.uah.edu/digitalcollections/files/original/76/4625/Loc_burw-1037.pdf,,"Burwell Family Collection",1,0
4626,http://libarchstor2.uah.edu/digitalcollections/items/show/4626,loc_burw_001038,"Photograph of a nurse outside in Italy.",,,"Burwell, Edwin D. III [Burwell, Edwin D., Jr.]",,1944-03,1940-1949,,,"United States--Armed Forces--Medical care^^War work--Red Cross^^World War, 1939-1945--Campaigns--Italy^^World War, 1939-1945--Military personnel","Photographs^^Still Image",,"Burwell Family Collection^^University of Alabama in Huntsville Archives, Special Collections, and Digital Initiatives, Huntsville, Alabama",,,,en,"This material may be protected under U. S. Copyright Law (Title 17, U.S. Code) which governs the making of photocopies or reproductions of copyrighted materials. You may use the digitized material for private study, scholarship, or research. Though the University of Alabama in Huntsville Archives and Special Collections has physical ownership of the material in its collections, in some cases we may not own the copyright to the material. It is the patron's obligation to determine and satisfy copyright restrictions when publishing or otherwise distributing materials found in our collections.",loc_burw_2021_04E,,,,,,,,,,,,,,,,,,,,,,,,,,,,,,,,,,,,,,,,,,,,,,,,,,,,,,,,,,,,,,,,,,,,,,,,,,,,,,,http://libarchstor2.uah.edu/digitalcollections/files/original/76/4626/Loc_burw-1038.pdf,,"Burwell Family Collection",1,0
4627,http://libarchstor2.uah.edu/digitalcollections/items/show/4627,loc_burw_001039,"Photograph of a nurse outside in Italy.",,,"Burwell, Edwin D. III [Burwell, Edwin D., Jr.]",,1944-03,1940-1949,,,"United States--Armed Forces--Medical care^^War work--Red Cross^^World War, 1939-1945--Campaigns--Italy^^World War, 1939-1945--Military personnel","Photographs^^Still Image",,"Burwell Family Collection^^University of Alabama in Huntsville Archives, Special Collections, and Digital Initiatives, Huntsville, Alabama",,,,en,"This material may be protected under U. S. Copyright Law (Title 17, U.S. Code) which governs the making of photocopies or reproductions of copyrighted materials. You may use the digitized material for private study, scholarship, or research. Though the University of Alabama in Huntsville Archives and Special Collections has physical ownership of the material in its collections, in some cases we may not own the copyright to the material. It is the patron's obligation to determine and satisfy copyright restrictions when publishing or otherwise distributing materials found in our collections.",loc_burw_2021_04E,,,,,,,,,,,,,,,,,,,,,,,,,,,,,,,,,,,,,,,,,,,,,,,,,,,,,,,,,,,,,,,,,,,,,,,,,,,,,,,http://libarchstor2.uah.edu/digitalcollections/files/original/76/4627/Loc_burw-1039.pdf,,"Burwell Family Collection",1,0
4629,http://libarchstor2.uah.edu/digitalcollections/items/show/4629,loc_burw_001041,"Photograph of a nurse outside in Italy.",,"The patch on the nurse's jacket reads: ""American Red  Cross-Military Welfare Service.""","Burwell, Edwin D. III [Burwell, Edwin D., Jr.]",,1944-03,1940-1949,,,"United States--Armed Forces--Medical care^^War work--Red Cross^^World War, 1939-1945--Campaigns--Italy^^World War, 1939-1945--Military personnel","Photographs^^Still Image",,"Burwell Family Collection^^University of Alabama in Huntsville Archives, Special Collections, and Digital Initiatives, Huntsville, Alabama",,,,en,"This material may be protected under U. S. Copyright Law (Title 17, U.S. Code) which governs the making of photocopies or reproductions of copyrighted materials. You may use the digitized material for private study, scholarship, or research. Though the University of Alabama in Huntsville Archives and Special Collections has physical ownership of the material in its collections, in some cases we may not own the copyright to the material. It is the patron's obligation to determine and satisfy copyright restrictions when publishing or otherwise distributing materials found in our collections.",loc_burw_2021_04E,,,,,,,,,,,,,,,,,,,,,,,,,,,,,,,,,,,,,,,,,,,,,,,,,,,,,,,,,,,,,,,,,,,,,,,,,,,,,,,http://libarchstor2.uah.edu/digitalcollections/files/original/76/4629/Loc_burw-1041.pdf,,"Burwell Family Collection",1,0
4098,http://libarchstor2.uah.edu/digitalcollections/items/show/4098,loc_burw_000864,"Photograph of a nurse outside at 95th Evacuation Hospital.",,,"Burwell, Edwin D. III [Burwell, Edwin D., Jr.]",,1944-02,1940-1949,,,"United States. Army. Evacuation Hospital, 95th^^United States--Armed Forces--Medical care^^World War, 1939-1945--Campaigns--Italy^^World War, 1939-1945--Military personnel","Photographs^^Still Image",,"Burwell Family Collection^^University of Alabama in Huntsville Archives, Special Collections, and Digital Initiatives, Huntsville, Alabama",,,,en,"This material may be protected under U. S. Copyright Law (Title 17, U.S. Code) which governs the making of photocopies or reproductions of copyrighted materials. You may use the digitized material for private study, scholarship, or research. Though the University of Alabama in Huntsville Archives and Special Collections has physical ownership of the material in its collections, in some cases we may not own the copyright to the material. It is the patron's obligation to determine and satisfy copyright restrictions when publishing or otherwise distributing materials found in our collections.",loc_burw_2021_04A,,,,,,,,,,,,,,,,,,,,,,,,,,,,,,,,,,,,,,,,,,,,,,,,,,,,,,,,,,,,,,,,,,,,,,,,,,,,,,,http://libarchstor2.uah.edu/digitalcollections/files/original/76/4098/loc_burw-_-864.pdf,,"Burwell Family Collection",1,0
4100,http://libarchstor2.uah.edu/digitalcollections/items/show/4100,loc_burw_000866,"Photograph of a nurse outside at 95th Evacuation Hospital.",,,"Burwell, Edwin D. III [Burwell, Edwin D., Jr.]",,1944-02,1940-1949,,,"United States. Army. Evacuation Hospital, 95th^^United States--Armed Forces--Medical care^^World War, 1939-1945--Campaigns--Italy^^World War, 1939-1945--Military personnel","Photographs^^Still Image",,"Burwell Family Collection^^University of Alabama in Huntsville Archives, Special Collections, and Digital Initiatives, Huntsville, Alabama",,,,en,"This material may be protected under U. S. Copyright Law (Title 17, U.S. Code) which governs the making of photocopies or reproductions of copyrighted materials. You may use the digitized material for private study, scholarship, or research. Though the University of Alabama in Huntsville Archives and Special Collections has physical ownership of the material in its collections, in some cases we may not own the copyright to the material. It is the patron's obligation to determine and satisfy copyright restrictions when publishing or otherwise distributing materials found in our collections.",loc_burw_2021_04A,,,,,,,,,,,,,,,,,,,,,,,,,,,,,,,,,,,,,,,,,,,,,,,,,,,,,,,,,,,,,,,,,,,,,,,,,,,,,,,http://libarchstor2.uah.edu/digitalcollections/files/original/76/4100/loc_burw-_-866.pdf,,"Burwell Family Collection",1,0
6182,http://libarchstor2.uah.edu/digitalcollections/items/show/6182," loc_burw_1734","Photograph of a nurse looking over the side of a boat, Great Britain.",,,"Burwell, Edwin D. III [Burwell, Edwin D., Jr.]",,1945-09,1940-1949,,,"Boats and boating^^Great Britain","Photographs^^Still Image","black-and-white prints","Burwell Family Collection^^University of Alabama in Huntsville Archives, Special Collections, and Digital Initiatives, Huntsville, Alabama",,,"This item was generously digitized by Dudley Burwell.",en,"This material may be protected under U. S. Copyright Law (Title 17, U.S. Code) which governs the making of photocopies or reproductions of copyrighted materials. You may use the digitized material for private study, scholarship, or research. Though the University of Alabama in Huntsville Archives and Special Collections has physical ownership of the material in its collections, in some cases we may not own the copyright to the material. It is the patron's obligation to determine and satisfy copyright restrictions when publishing or otherwise distributing materials found in our collections.",loc_burw_2021_06,,,,,,,,,,,,,,,,,,,,,,,,,,,,,,,,,,,,,,,,,,,,,,,,,,,,,,,,,,,,,,,,,,,,,,,,,,,,,,,http://libarchstor2.uah.edu/digitalcollections/files/original/76/6182/Loc_burw--1734.pdf,,"Burwell Family Collection",1,0
6183,http://libarchstor2.uah.edu/digitalcollections/items/show/6183," loc_burw_1735","Photograph of a nurse looking over the side of a boat, Great Britain.",,,"Burwell, Edwin D. III [Burwell, Edwin D., Jr.]",,1945-09,1940-1949,,,"Boats and boating^^Great Britain","Photographs^^Still Image","black-and-white prints","Burwell Family Collection^^University of Alabama in Huntsville Archives, Special Collections, and Digital Initiatives, Huntsville, Alabama",,,"This item was generously digitized by Dudley Burwell.",en,"This material may be protected under U. S. Copyright Law (Title 17, U.S. Code) which governs the making of photocopies or reproductions of copyrighted materials. You may use the digitized material for private study, scholarship, or research. Though the University of Alabama in Huntsville Archives and Special Collections has physical ownership of the material in its collections, in some cases we may not own the copyright to the material. It is the patron's obligation to determine and satisfy copyright restrictions when publishing or otherwise distributing materials found in our collections.",loc_burw_2021_06,,,,,,,,,,,,,,,,,,,,,,,,,,,,,,,,,,,,,,,,,,,,,,,,,,,,,,,,,,,,,,,,,,,,,,,,,,,,,,,http://libarchstor2.uah.edu/digitalcollections/files/original/76/6183/Loc_burw--1735.pdf,,"Burwell Family Collection",1,0
4323,http://libarchstor2.uah.edu/digitalcollections/items/show/4323,loc_burw_000875,"Photograph of a nurse leaning on a balcony at the 300th General Hospital in Naples, Italy.",,"The nurse is holding flowers.","Burwell, Edwin D. III [Burwell, Edwin D., Jr.]",,1944-02,1940-1949,,,"300th General Hospital (United States. Army)^^United States--Armed Forces--Medical care^^World War, 1939-1945--Campaigns--Italy^^World War, 1939-1945--Military personnel^^Naples (Italy)","Photographs^^Still Image",,"Burwell Family Collection^^University of Alabama in Huntsville Archives, Special Collections, and Digital Initiatives, Huntsville, Alabama",,,,en,"This material may be protected under U. S. Copyright Law (Title 17, U.S. Code) which governs the making of photocopies or reproductions of copyrighted materials. You may use the digitized material for private study, scholarship, or research. Though the University of Alabama in Huntsville Archives and Special Collections has physical ownership of the material in its collections, in some cases we may not own the copyright to the material. It is the patron's obligation to determine and satisfy copyright restrictions when publishing or otherwise distributing materials found in our collections.",loc_burw_2021_04B,,,,,,,,,,,,,,,,,,,,,,,,,,,,,,,,,,,,,,,,,,,,,,,,,,,,,,,,,,,,,,,,,,,,,,,,,,,,,,,http://libarchstor2.uah.edu/digitalcollections/files/original/76/4323/loc_burw-_-875.pdf,,"Burwell Family Collection",1,0