﻿"Item Id","Item URI","Dublin Core:Identifier","Dublin Core:Title","Dublin Core:Alternative Title","Dublin Core:Description","Dublin Core:Creator","Dublin Core:Publisher","Dublin Core:Date","Dublin Core:Temporal Coverage","Dublin Core:Coverage","Dublin Core:Spatial Coverage","Dublin Core:Subject","Dublin Core:Type","Dublin Core:Format","Dublin Core:Source","Dublin Core:Is Part Of","Dublin Core:Has Format","Dublin Core:Provenance","Dublin Core:Language","Dublin Core:Rights","Dublin Core:Relation","Dublin Core:Contributor","Dublin Core:Abstract","Dublin Core:Table Of Contents","Dublin Core:Date Available","Dublin Core:Date Created","Dublin Core:Date Accepted","Dublin Core:Date Copyrighted","Dublin Core:Date Submitted","Dublin Core:Date Issued","Dublin Core:Date Modified","Dublin Core:Date Valid","Dublin Core:Access Rights","Dublin Core:License","Dublin Core:Conforms To","Dublin Core:Has Part","Dublin Core:Has Version","Dublin Core:Is Format Of","Dublin Core:Is Referenced By","Dublin Core:Is Replaced By","Dublin Core:Is Required By","Dublin Core:Is Version Of","Dublin Core:References","Dublin Core:Replaces","Dublin Core:Requires","Dublin Core:Extent","Dublin Core:Medium","Dublin Core:Bibliographic Citation","Dublin Core:Accrual Method","Dublin Core:Accrual Periodicity","Dublin Core:Accrual Policy","Dublin Core:Audience","Dublin Core:Audience Education Level","Dublin Core:Mediator","Dublin Core:Instructional Method","Dublin Core:Rights Holder","Item Type Metadata:Text","Item Type Metadata:Interviewer","Item Type Metadata:Interviewee","Item Type Metadata:Location","Item Type Metadata:Transcription","Item Type Metadata:Local URL","Item Type Metadata:Original Format","Item Type Metadata:Physical Dimensions","Item Type Metadata:Duration","Item Type Metadata:Compression","Item Type Metadata:Producer","Item Type Metadata:Director","Item Type Metadata:Bit Rate/Frequency","Item Type Metadata:Time Summary","Item Type Metadata:Email Body","Item Type Metadata:Subject Line","Item Type Metadata:From","Item Type Metadata:To","Item Type Metadata:CC","Item Type Metadata:BCC","Item Type Metadata:Number of Attachments","Item Type Metadata:Standards","Item Type Metadata:Objectives","Item Type Metadata:Materials","Item Type Metadata:Lesson Plan Text","Item Type Metadata:URL","Item Type Metadata:Event Type","Item Type Metadata:Participants","Item Type Metadata:Birth Date","Item Type Metadata:Birthplace","Item Type Metadata:Death Date","Item Type Metadata:Occupation","Item Type Metadata:Biographical Text","Item Type Metadata:Bibliography","Item Type Metadata:Player","Item Type Metadata:Imported Thumbnail","Item Type Metadata:OHMS Object","Item Type Metadata:OHMS Object Text","Item Type Metadata:Interview Keyword","Item Type Metadata:Sort Priority","PDF Text:Text",Scripto:Transcription,tags,file,itemType,collection,public,featured
1944,http://libarchstor2.uah.edu/digitalcollections/items/show/1944,uah_hockey_002,"""A New Year's Maine Attraction.""",,"This flier advertises a trip to Maine for UAH hockey fans to see ""the Chargers capture the top-ranked Black Bears of the University of Maine."" Tours of Maine scenery and sites, a ""New England Style Dinner,"" lodging, and transportation are offered in the package. ","University of Alabama in Huntsville. Division of Continuing Education",,1989-01,1980-1989,,,"College sports^^Continuing education--United States^^Hockey^^University of Alabama in Huntsville^^Huntsville (Ala.)^^Madison County (Ala.)","Fliers (Printed matter)^^Text",,"University of Alabama in Huntsville Archives, Special Collections, and Digital Initiatives, Huntsville, Alabama",,,,en,"This material may be protected under U. S. Copyright Law (Title 17, U.S. Code) which governs the making of photocopies or reproductions of copyrighted materials. You may use the digitized material for private study, scholarship, or research. Though the University of Alabama in Huntsville Archives and Special Collections has physical ownership of the material in its collections, in some cases we may not own the copyright to the material. It is the patron's obligation to determine and satisfy copyright restrictions when publishing or otherwise distributing materials found in our collections.",,,,,,,,,,,,,,,,,,,,,,,,,,,,,,,,,,,,,,,,,,,,,,,,,,,,,,,,,,,,,,,,,,,,,,,,,,,,,,,,http://libarchstor2.uah.edu/digitalcollections/files/original/55/1944/uah_hockey_003.pdf,,"UAH History Collection",1,0
1585,http://libarchstor2.uah.edu/digitalcollections/items/show/1585,spc_spac_000368_000369,"""All New Junior Hot Rod Car.""",,"This flier has an image of the ""All New Junior Hot Rod Car"" as well as a description and a price for it. ","Hot Rods, Inc.",,,1960-1969,,,"Amusement rides^^Motor vehicles","Advertisements^^Fliers (Printed matter)^^Still Image^^Text",,"Space City Collection^^Box 3^^University of Alabama in Huntsville Archives, Special Collections, and Digital Initiatives, Huntsville, Alabama",,,"This collection was generously loaned for digitization by Dustin Shannon. The collection is digital only.",en,"This material may be protected under U. S. Copyright Law (Title 17, U.S. Code) which governs the making of photocopies or reproductions of copyrighted materials. You may use the digitized material for private study, scholarship, or research. Though the University of Alabama in Huntsville Archives and Special Collections has physical ownership of the material in its collections, in some cases we may not own the copyright to the material. It is the patron's obligation to determine and satisfy copyright restrictions when publishing or otherwise distributing materials found in our collections.",spc_spac_2020_02,,,,,,,,,,,,,,,,,,,,,,,,,,,,,,,,,,,,,,,,,,,,,,,,,,,,,,,,,,,,,,,,,,,,,,,,,,,,,,,http://libarchstor2.uah.edu/digitalcollections/files/original/75/1585/spc_spac_000368_000369.pdf,,"Space City Collection",1,0
1571,http://libarchstor2.uah.edu/digitalcollections/items/show/1571,spc_spac_000344_000345,"""Bubble Bounce.""",,"This flier has a description, specifications, photographs, and an illustration of the Bubble Bounce ride.","McFadden, Richard B.",,,1960-1969,,,"Amusement rides","Advertisements^^Fliers (Printed matter)^^Still Image^^Text",,"Space City Collection^^Box 3^^University of Alabama in Huntsville Archives, Special Collections, and Digital Initiatives, Huntsville, Alabama",,,"This collection was generously loaned for digitization by Dustin Shannon. The collection is digital only.",en,"This material may be protected under U. S. Copyright Law (Title 17, U.S. Code) which governs the making of photocopies or reproductions of copyrighted materials. You may use the digitized material for private study, scholarship, or research. Though the University of Alabama in Huntsville Archives and Special Collections has physical ownership of the material in its collections, in some cases we may not own the copyright to the material. It is the patron's obligation to determine and satisfy copyright restrictions when publishing or otherwise distributing materials found in our collections.",spc_spac_2020_02,,,,,,,,,,,,,,,,,,,,,,,,,,,,,,,,,,,,,,,,,,,,,,,,,,,,,,,,,,,,,,,,,,,,,,,,,,,,,,,http://libarchstor2.uah.edu/digitalcollections/files/original/75/1571/spc_spac_000344_000345.pdf,,"Space City Collection",1,0
1588,http://libarchstor2.uah.edu/digitalcollections/items/show/1588,spc_spac_000372_000373,"""Calypso.""",,"This flier has an image of the ""Calypso"" as well as a description and a price for it. ","Hot Rods, Inc.",,,1960-1969,,,"Amusement rides","Advertisements^^Fliers (Printed matter)^^Still Image^^Text",,"Space City Collection^^Box 3^^University of Alabama in Huntsville Archives, Special Collections, and Digital Initiatives, Huntsville, Alabama",,,"This collection was generously loaned for digitization by Dustin Shannon. The collection is digital only.",en,"This material may be protected under U. S. Copyright Law (Title 17, U.S. Code) which governs the making of photocopies or reproductions of copyrighted materials. You may use the digitized material for private study, scholarship, or research. Though the University of Alabama in Huntsville Archives and Special Collections has physical ownership of the material in its collections, in some cases we may not own the copyright to the material. It is the patron's obligation to determine and satisfy copyright restrictions when publishing or otherwise distributing materials found in our collections.",spc_spac_2020_02,,,,,,,,,,,,,,,,,,,,,,,,,,,,,,,,,,,,,,,,,,,,,,,,,,,,,,,,,,,,,,,,,,,,,,,,,,,,,,,http://libarchstor2.uah.edu/digitalcollections/files/original/75/1588/spc_spac_000372_000373.pdf,,"Space City Collection",1,0
1590,http://libarchstor2.uah.edu/digitalcollections/items/show/1590,spc_spac_000376_000377,"""Electric Skooter.""",,"This flier has an image of the two models of ""Electric Skooter"" as well as descriptions for them.","Hot Rods, Inc.",,,1960-1969,,,"Amusement rides^^Motor vehicles","Advertisements^^Fliers (Printed matter)^^Still Image^^Text",,"Space City Collection^^Box 3^^University of Alabama in Huntsville Archives, Special Collections, and Digital Initiatives, Huntsville, Alabama",,,"This collection was generously loaned for digitization by Dustin Shannon. The collection is digital only.",en,"This material may be protected under U. S. Copyright Law (Title 17, U.S. Code) which governs the making of photocopies or reproductions of copyrighted materials. You may use the digitized material for private study, scholarship, or research. Though the University of Alabama in Huntsville Archives and Special Collections has physical ownership of the material in its collections, in some cases we may not own the copyright to the material. It is the patron's obligation to determine and satisfy copyright restrictions when publishing or otherwise distributing materials found in our collections.",spc_spac_2020_02,,,,,,,,,,,,,,,,,,,,,,,,,,,,,,,,,,,,,,,,,,,,,,,,,,,,,,,,,,,,,,,,,,,,,,,,,,,,,,,http://libarchstor2.uah.edu/digitalcollections/files/original/75/1590/spc_spac_000376_000377.pdf,,"Space City Collection",1,0
1552,http://libarchstor2.uah.edu/digitalcollections/items/show/1552,spc_spac_000293_000294,"""Ful-Stride Roto-Gate.""",,"This advertisement provides images, features, and specifications for the ""Type B Impenetrable"" gate. The back of the flier has two illustrations, one of children being prevented from sneaking into the park, and one focusing on the ease of the gate's use.","Perey Turnstile Company",,,1960-1969,,,"Amusement parks--Equipment and supplies","Advertisements^^Fliers (Printed matter)^^Still Image^^Text",,"Space City Collection^^Box 3^^University of Alabama in Huntsville Archives, Special Collections, and Digital Initiatives, Huntsville, Alabama",,,"This collection was generously loaned for digitization by Dustin Shannon. The collection is digital only.",en,"This material may be protected under U. S. Copyright Law (Title 17, U.S. Code) which governs the making of photocopies or reproductions of copyrighted materials. You may use the digitized material for private study, scholarship, or research. Though the University of Alabama in Huntsville Archives and Special Collections has physical ownership of the material in its collections, in some cases we may not own the copyright to the material. It is the patron's obligation to determine and satisfy copyright restrictions when publishing or otherwise distributing materials found in our collections.",spc_spac_2020_02,,,,,,,,,,,,,,,,,,,,,,,,,,,,,,,,,,,,,,,,,,,,,,,,,,,,,,,,,,,,,,,,,,,,,,,,,,,,,,,http://libarchstor2.uah.edu/digitalcollections/files/original/75/1552/spc_spac_000293_000294.pdf,,"Space City Collection",1,0
1584,http://libarchstor2.uah.edu/digitalcollections/items/show/1584,spc_spac_000366_000367,"""German Carousel.""",,"This flier has an image of the ""German Carousel"" as well as a description, specifications, and a price for it. ","Hot Rods, Inc.",,,1960-1969,,,"Amusement rides^^Merry-go-round","Advertisements^^Fliers (Printed matter)^^Still Image^^Text",,"Space City Collection^^Box 3^^University of Alabama in Huntsville Archives, Special Collections, and Digital Initiatives, Huntsville, Alabama",,,"This collection was generously loaned for digitization by Dustin Shannon. The collection is digital only.",en,"This material may be protected under U. S. Copyright Law (Title 17, U.S. Code) which governs the making of photocopies or reproductions of copyrighted materials. You may use the digitized material for private study, scholarship, or research. Though the University of Alabama in Huntsville Archives and Special Collections has physical ownership of the material in its collections, in some cases we may not own the copyright to the material. It is the patron's obligation to determine and satisfy copyright restrictions when publishing or otherwise distributing materials found in our collections.",spc_spac_2020_02,,,,,,,,,,,,,,,,,,,,,,,,,,,,,,,,,,,,,,,,,,,,,,,,,,,,,,,,,,,,,,,,,,,,,,,,,,,,,,,http://libarchstor2.uah.edu/digitalcollections/files/original/75/1584/spc_spac_000366_000367.pdf,,"Space City Collection",1,0
1580,http://libarchstor2.uah.edu/digitalcollections/items/show/1580,spc_spac_000359_000360,"""Junior Hot Rod Ride.""",,"This flier has a colored image of the ""Junior Hot Rod Ride"" as well as a description and price for it. ","Hot Rods, Inc.",,,1960-1969,,,"Amusement rides^^Motor vehicles","Advertisements^^Fliers (Printed matter)^^Still Image^^Text",,"Space City Collection^^Box 3^^University of Alabama in Huntsville Archives, Special Collections, and Digital Initiatives, Huntsville, Alabama",,,"This collection was generously loaned for digitization by Dustin Shannon. The collection is digital only.",en,"This material may be protected under U. S. Copyright Law (Title 17, U.S. Code) which governs the making of photocopies or reproductions of copyrighted materials. You may use the digitized material for private study, scholarship, or research. Though the University of Alabama in Huntsville Archives and Special Collections has physical ownership of the material in its collections, in some cases we may not own the copyright to the material. It is the patron's obligation to determine and satisfy copyright restrictions when publishing or otherwise distributing materials found in our collections.",spc_spac_2020_02,,,,,,,,,,,,,,,,,,,,,,,,,,,,,,,,,,,,,,,,,,,,,,,,,,,,,,,,,,,,,,,,,,,,,,,,,,,,,,,http://libarchstor2.uah.edu/digitalcollections/files/original/75/1580/spc_spac_000359_000360.pdf,,"Space City Collection",1,0
1553,http://libarchstor2.uah.edu/digitalcollections/items/show/1553,spc_spac_000295,"""Kiddie Flyer Hand Car Ride.""",,"The advertisement gives a description of the ride, its shipping weight, and its price.","Hampton Amusement Company",,,1960-1969,,,"Amusement rides","Advertisements^^Fliers (Printed matter)^^Text",,"Space City Collection^^Box 3^^University of Alabama in Huntsville Archives, Special Collections, and Digital Initiatives, Huntsville, Alabama",,,"This collection was generously loaned for digitization by Dustin Shannon. The collection is digital only.",en,"This material may be protected under U. S. Copyright Law (Title 17, U.S. Code) which governs the making of photocopies or reproductions of copyrighted materials. You may use the digitized material for private study, scholarship, or research. Though the University of Alabama in Huntsville Archives and Special Collections has physical ownership of the material in its collections, in some cases we may not own the copyright to the material. It is the patron's obligation to determine and satisfy copyright restrictions when publishing or otherwise distributing materials found in our collections.",spc_spac_2020_02,,,,,,,,,,,,,,,,,,,,,,,,,,,,,,,,,,,,,,,,,,,,,,,,,,,,,,,,,,,,,,,,,,,,,,,,,,,,,,,http://libarchstor2.uah.edu/digitalcollections/files/original/75/1553/spc_spac_000295.pdf,,"Space City Collection",1,0
1551,http://libarchstor2.uah.edu/digitalcollections/items/show/1551,spc_spac_000289_000292,"""Kompak Coinpassor Model 97.""",,"This advertisement provides images, features, and specifications for the turnstile.","Perey Turnstile Company",,,1960-1969,,,"Amusement parks--Equipment and supplies","Advertisements^^Fliers (Printed matter)^^Still Image^^Text",,"Space City Collection^^Box 3^^University of Alabama in Huntsville Archives, Special Collections, and Digital Initiatives, Huntsville, Alabama",,,"This collection was generously loaned for digitization by Dustin Shannon. The collection is digital only.",en,"This material may be protected under U. S. Copyright Law (Title 17, U.S. Code) which governs the making of photocopies or reproductions of copyrighted materials. You may use the digitized material for private study, scholarship, or research. Though the University of Alabama in Huntsville Archives and Special Collections has physical ownership of the material in its collections, in some cases we may not own the copyright to the material. It is the patron's obligation to determine and satisfy copyright restrictions when publishing or otherwise distributing materials found in our collections.",spc_spac_2020_02,,,,,,,,,,,,,,,,,,,,,,,,,,,,,,,,,,,,,,,,,,,,,,,,,,,,,,,,,,,,,,,,,,,,,,,,,,,,,,,http://libarchstor2.uah.edu/digitalcollections/files/original/75/1551/spc_spac_000289_000292.pdf,,"Space City Collection",1,0
1572,http://libarchstor2.uah.edu/digitalcollections/items/show/1572,spc_spac_000346_000347,"""Litter Bug"" vacuum cleaner.",,"This flier describes the Litter Bug outdoor vacuum cleaner and its three models.","McFadden, Richard B.",,,1960-1969,,,"Amusement rides","Advertisements^^Fliers (Printed matter)^^Still Image^^Text",,"Space City Collection^^Box 3^^University of Alabama in Huntsville Archives, Special Collections, and Digital Initiatives, Huntsville, Alabama",,,"This collection was generously loaned for digitization by Dustin Shannon. The collection is digital only.",en,"This material may be protected under U. S. Copyright Law (Title 17, U.S. Code) which governs the making of photocopies or reproductions of copyrighted materials. You may use the digitized material for private study, scholarship, or research. Though the University of Alabama in Huntsville Archives and Special Collections has physical ownership of the material in its collections, in some cases we may not own the copyright to the material. It is the patron's obligation to determine and satisfy copyright restrictions when publishing or otherwise distributing materials found in our collections.",spc_spac_2020_02,,,,,,,,,,,,,,,,,,,,,,,,,,,,,,,,,,,,,,,,,,,,,,,,,,,,,,,,,,,,,,,,,,,,,,,,,,,,,,,http://libarchstor2.uah.edu/digitalcollections/files/original/75/1572/spc_spac_000346_000347.pdf,,"Space City Collection",1,0
1550,http://libarchstor2.uah.edu/digitalcollections/items/show/1550,spc_spac_000287_000288,"""No. 20-Deep Arm-Traffic Controller.""",,"This advertisement provides images, features, specifications, and installation diagrams for the ""All Metal, One Way, Non-Registering Turnstile.""","Perey Turnstile Company",,,1960-1969,,,"Amusement parks--Equipment and supplies","Advertisements^^Fliers (Printed matter)^^Still Image^^Text",,"Space City Collection^^Box 3^^University of Alabama in Huntsville Archives, Special Collections, and Digital Initiatives, Huntsville, Alabama",,,"This collection was generously loaned for digitization by Dustin Shannon. The collection is digital only.",en,"This material may be protected under U. S. Copyright Law (Title 17, U.S. Code) which governs the making of photocopies or reproductions of copyrighted materials. You may use the digitized material for private study, scholarship, or research. Though the University of Alabama in Huntsville Archives and Special Collections has physical ownership of the material in its collections, in some cases we may not own the copyright to the material. It is the patron's obligation to determine and satisfy copyright restrictions when publishing or otherwise distributing materials found in our collections.",spc_spac_2020_02,,,,,,,,,,,,,,,,,,,,,,,,,,,,,,,,,,,,,,,,,,,,,,,,,,,,,,,,,,,,,,,,,,,,,,,,,,,,,,,http://libarchstor2.uah.edu/digitalcollections/files/original/75/1550/spc_spac_000287_000288.pdf,,"Space City Collection",1,0
918,http://libarchstor2.uah.edu/digitalcollections/items/show/918,uah_uahh_000034,"""Recommendations for a consolidated library.""",,"The flier discusses coordination of library services between the UAH Library, the Research Institute, and Redstone Scientific Information Center.","University of Alabama in Huntsville",,1964,1960-1969,,,"Academic libraries--Circulation and loans^^Redstone Scientific Information Center^^University of Alabama in Huntsville^^University of Alabama in Huntsville. Research Institute^^Huntsville (Ala.)^^Redstone Arsenal (Ala.)^^Madison County (Ala.)","Fliers (Printed matter)^^Text",,"UAH History Collection^^University of Alabama in Huntsville Archives, Special Collections, and Digital Initiatives, Huntsville, Alabama",,,"This item was digitized for the Apollo 11 50th anniversary celebration.",en,"This material may be protected under U. S. Copyright Law (Title 17, U.S. Code) which governs the making of photocopies or reproductions of copyrighted materials. You may use the digitized material for private study, scholarship, or research. Though the University of Alabama in Huntsville Archives and Special Collections has physical ownership of the material in its collections, in some cases we may not own the copyright to the material. It is the patron's obligation to determine and satisfy copyright restrictions when publishing or otherwise distributing materials found in our collections.",ap11_exhibit_2019_08,,,,,,,,,,,,,,,,,,,,,,,,,,,,,,,,,,,,,,,,,,,,,,,,,,,,,,,,,,,,,,,,,,,,,,,,,,,,,,,http://libarchstor2.uah.edu/digitalcollections/files/original/55/918/uah_uahh_000034.pdf,,"UAH History Collection",1,0
1559,http://libarchstor2.uah.edu/digitalcollections/items/show/1559,spc_spac_000304,"""Rental Karts must be TOUGH-Simplex-Mark V.""",,"This advertisement provides an image, a description, and prices for the Simplex Mark V.","Simplex Manufacturing Corporation",,,1960-1969,,,"Amusement rides^^Karting","Advertisements^^Fliers (Printed matter)^^Still Image^^Text",,"Space City Collection^^Box 3^^University of Alabama in Huntsville Archives, Special Collections, and Digital Initiatives, Huntsville, Alabama",,,"This collection was generously loaned for digitization by Dustin Shannon. The collection is digital only.",en,"This material may be protected under U. S. Copyright Law (Title 17, U.S. Code) which governs the making of photocopies or reproductions of copyrighted materials. You may use the digitized material for private study, scholarship, or research. Though the University of Alabama in Huntsville Archives and Special Collections has physical ownership of the material in its collections, in some cases we may not own the copyright to the material. It is the patron's obligation to determine and satisfy copyright restrictions when publishing or otherwise distributing materials found in our collections.",spc_spac_2020_02,,,,,,,,,,,,,,,,,,,,,,,,,,,,,,,,,,,,,,,,,,,,,,,,,,,,,,,,,,,,,,,,,,,,,,,,,,,,,,,http://libarchstor2.uah.edu/digitalcollections/files/original/75/1559/spc_spac_000304.pdf,,"Space City Collection",1,0