﻿"Item Id","Item URI","Dublin Core:Identifier","Dublin Core:Title","Dublin Core:Alternative Title","Dublin Core:Description","Dublin Core:Creator","Dublin Core:Publisher","Dublin Core:Date","Dublin Core:Temporal Coverage","Dublin Core:Coverage","Dublin Core:Spatial Coverage","Dublin Core:Subject","Dublin Core:Type","Dublin Core:Format","Dublin Core:Source","Dublin Core:Is Part Of","Dublin Core:Has Format","Dublin Core:Provenance","Dublin Core:Language","Dublin Core:Rights","Dublin Core:Relation","Dublin Core:Contributor","Dublin Core:Abstract","Dublin Core:Table Of Contents","Dublin Core:Date Available","Dublin Core:Date Created","Dublin Core:Date Accepted","Dublin Core:Date Copyrighted","Dublin Core:Date Submitted","Dublin Core:Date Issued","Dublin Core:Date Modified","Dublin Core:Date Valid","Dublin Core:Access Rights","Dublin Core:License","Dublin Core:Conforms To","Dublin Core:Has Part","Dublin Core:Has Version","Dublin Core:Is Format Of","Dublin Core:Is Referenced By","Dublin Core:Is Replaced By","Dublin Core:Is Required By","Dublin Core:Is Version Of","Dublin Core:References","Dublin Core:Replaces","Dublin Core:Requires","Dublin Core:Extent","Dublin Core:Medium","Dublin Core:Bibliographic Citation","Dublin Core:Accrual Method","Dublin Core:Accrual Periodicity","Dublin Core:Accrual Policy","Dublin Core:Audience","Dublin Core:Audience Education Level","Dublin Core:Mediator","Dublin Core:Instructional Method","Dublin Core:Rights Holder","Item Type Metadata:Text","Item Type Metadata:Interviewer","Item Type Metadata:Interviewee","Item Type Metadata:Location","Item Type Metadata:Transcription","Item Type Metadata:Local URL","Item Type Metadata:Original Format","Item Type Metadata:Physical Dimensions","Item Type Metadata:Duration","Item Type Metadata:Compression","Item Type Metadata:Producer","Item Type Metadata:Director","Item Type Metadata:Bit Rate/Frequency","Item Type Metadata:Time Summary","Item Type Metadata:Email Body","Item Type Metadata:Subject Line","Item Type Metadata:From","Item Type Metadata:To","Item Type Metadata:CC","Item Type Metadata:BCC","Item Type Metadata:Number of Attachments","Item Type Metadata:Standards","Item Type Metadata:Objectives","Item Type Metadata:Materials","Item Type Metadata:Lesson Plan Text","Item Type Metadata:URL","Item Type Metadata:Event Type","Item Type Metadata:Participants","Item Type Metadata:Birth Date","Item Type Metadata:Birthplace","Item Type Metadata:Death Date","Item Type Metadata:Occupation","Item Type Metadata:Biographical Text","Item Type Metadata:Bibliography","Item Type Metadata:Player","Item Type Metadata:Imported Thumbnail","Item Type Metadata:OHMS Object","Item Type Metadata:OHMS Object Text","Item Type Metadata:Interview Keyword","Item Type Metadata:Sort Priority","PDF Text:Text",Scripto:Transcription,tags,file,itemType,collection,public,featured
4787,http://libarchstor2.uah.edu/digitalcollections/items/show/4787,uah_uahp_000509,"1990 UAH men's soccer team in action.",,,"University of Alabama in Huntsville",,1990,1990-1999,,,"College sports^^Soccer matches^^Soccer teams^^University of Alabama in Huntsville^^Huntsville (Ala.)^^Madison County (Ala.)","Still Image^^Photographs",Slides,"UAH Photographs",,,,en,"This material may be protected under U. S. Copyright Law (Title 17, U.S. Code) which governs the making of photocopies or reproductions of copyrighted materials. You may use the digitized material for private study, scholarship, or research. Though the University of Alabama in Huntsville Archives and Special Collections has physical ownership of the material in its collections, in some cases we may not own the copyright to the material. It is the patron's obligation to determine and satisfy copyright restrictions when publishing or otherwise distributing materials found in our collections.",uah_uahp_soccer_2021_05,,,,,,,,,,,,,,,,,,,,,,,,,,,,,,,,,,,,,,,,,,,,,,,,,,,,,,,,,,,,,,,,,,,,,,,,,,,,,,,http://libarchstor2.uah.edu/digitalcollections/files/original/40/4787/uah_uahp_000509.pdf,,"UAH Photograph Collection",1,0
4786,http://libarchstor2.uah.edu/digitalcollections/items/show/4786,uah_uahp_000508,"1990 UAH men's soccer team in action.",,,"University of Alabama in Huntsville",,1990,1990-1999,,,"College sports^^Soccer matches^^Soccer teams^^University of Alabama in Huntsville^^Huntsville (Ala.)^^Madison County (Ala.)","Still Image^^Photographs",Slides,"UAH Photographs",,,,en,"This material may be protected under U. S. Copyright Law (Title 17, U.S. Code) which governs the making of photocopies or reproductions of copyrighted materials. You may use the digitized material for private study, scholarship, or research. Though the University of Alabama in Huntsville Archives and Special Collections has physical ownership of the material in its collections, in some cases we may not own the copyright to the material. It is the patron's obligation to determine and satisfy copyright restrictions when publishing or otherwise distributing materials found in our collections.",uah_uahp_soccer_2021_05,,,,,,,,,,,,,,,,,,,,,,,,,,,,,,,,,,,,,,,,,,,,,,,,,,,,,,,,,,,,,,,,,,,,,,,,,,,,,,,http://libarchstor2.uah.edu/digitalcollections/files/original/40/4786/uah_uahp_000508.pdf,,"UAH Photograph Collection",1,0
4785,http://libarchstor2.uah.edu/digitalcollections/items/show/4785,uah_uahp_000507,"1990 UAH men's soccer team in action.",,,"University of Alabama in Huntsville",,1990,1990-1999,,,"College sports^^Soccer matches^^Soccer teams^^University of Alabama in Huntsville^^Huntsville (Ala.)^^Madison County (Ala.)","Still Image^^Photographs",Slides,"UAH Photographs",,,,en,"This material may be protected under U. S. Copyright Law (Title 17, U.S. Code) which governs the making of photocopies or reproductions of copyrighted materials. You may use the digitized material for private study, scholarship, or research. Though the University of Alabama in Huntsville Archives and Special Collections has physical ownership of the material in its collections, in some cases we may not own the copyright to the material. It is the patron's obligation to determine and satisfy copyright restrictions when publishing or otherwise distributing materials found in our collections.",uah_uahp_soccer_2021_05,,,,,,,,,,,,,,,,,,,,,,,,,,,,,,,,,,,,,,,,,,,,,,,,,,,,,,,,,,,,,,,,,,,,,,,,,,,,,,,http://libarchstor2.uah.edu/digitalcollections/files/original/40/4785/uah_uahp_000507.pdf,,"UAH Photograph Collection",1,0
4784,http://libarchstor2.uah.edu/digitalcollections/items/show/4784,uah_uahp_000506,"Coach Carlos Petersen confers with the UAH men's soccer team.",,,"Keim, Dennis",,1992,1990-1999,,,"Petersen, Carlos^^College sports^^Soccer teams^^University of Alabama in Huntsville^^Huntsville (Ala.)^^Madison County (Ala.)","Still Image^^Photographs",Slides,"UAH Photographs",,,,en,"This material may be protected under U. S. Copyright Law (Title 17, U.S. Code) which governs the making of photocopies or reproductions of copyrighted materials. You may use the digitized material for private study, scholarship, or research. Though the University of Alabama in Huntsville Archives and Special Collections has physical ownership of the material in its collections, in some cases we may not own the copyright to the material. It is the patron's obligation to determine and satisfy copyright restrictions when publishing or otherwise distributing materials found in our collections.",uah_uahp_soccer_2021_05,,,,,,,,,,,,,,,,,,,,,,,,,,,,,,,,,,,,,,,,,,,,,,,,,,,,,,,,,,,,,,,,,,,,,,,,,,,,,,,http://libarchstor2.uah.edu/digitalcollections/files/original/40/4784/uah_uahp_000506.pdf,,"UAH Photograph Collection",1,0
4783,http://libarchstor2.uah.edu/digitalcollections/items/show/4783,uah_uahp_000505,"Action shot from UAH men's soccer game.",,,"Keim, Dennis",,1992,1990-1999,,,"College sports^^Soccer matches^^Soccer teams^^University of Alabama in Huntsville^^Huntsville (Ala.)^^Madison County (Ala.)","Still Image^^Photographs",Prints,"UAH Photographs",,,,en,"This material may be protected under U. S. Copyright Law (Title 17, U.S. Code) which governs the making of photocopies or reproductions of copyrighted materials. You may use the digitized material for private study, scholarship, or research. Though the University of Alabama in Huntsville Archives and Special Collections has physical ownership of the material in its collections, in some cases we may not own the copyright to the material. It is the patron's obligation to determine and satisfy copyright restrictions when publishing or otherwise distributing materials found in our collections.",uah_uahp_soccer_2021_05,,,,,,,,,,,,,,,,,,,,,,,,,,,,,,,,,,,,,,,,,,,,,,,,,,,,,,,,,,,,,,,,,,,,,,,,,,,,,,,http://libarchstor2.uah.edu/digitalcollections/files/original/40/4783/uah_uahp_000505.pdf,,"UAH Photograph Collection",1,0
4782,http://libarchstor2.uah.edu/digitalcollections/items/show/4782,uah_uahp_000504,"Action shot from UAH men's soccer game.",,"Ricky Crawford (8) shown at left.","Keim, Dennis",,1992,1990-1999,,,"College sports^^Soccer matches^^Soccer teams^^University of Alabama in Huntsville^^Huntsville (Ala.)^^Madison County (Ala.)","Still Image^^Photographs",Prints,"UAH Photographs",,,,en,"This material may be protected under U. S. Copyright Law (Title 17, U.S. Code) which governs the making of photocopies or reproductions of copyrighted materials. You may use the digitized material for private study, scholarship, or research. Though the University of Alabama in Huntsville Archives and Special Collections has physical ownership of the material in its collections, in some cases we may not own the copyright to the material. It is the patron's obligation to determine and satisfy copyright restrictions when publishing or otherwise distributing materials found in our collections.",uah_uahp_soccer_2021_05,,,,,,,,,,,,,,,,,,,,,,,,,,,,,,,,,,,,,,,,,,,,,,,,,,,,,,,,,,,,,,,,,,,,,,,,,,,,,,,http://libarchstor2.uah.edu/digitalcollections/files/original/40/4782/uah_uahp_000504.pdf,,"UAH Photograph Collection",1,0
4781,http://libarchstor2.uah.edu/digitalcollections/items/show/4781,uah_uahp_000503,"Action shot from UAH men's soccer game.",,,"Keim, Dennis",,1992,1990-1999,,,"College sports^^Soccer matches^^Soccer teams^^University of Alabama in Huntsville^^Huntsville (Ala.)^^Madison County (Ala.)","Still Image^^Photographs",Prints,"UAH Photographs",,,,en,"This material may be protected under U. S. Copyright Law (Title 17, U.S. Code) which governs the making of photocopies or reproductions of copyrighted materials. You may use the digitized material for private study, scholarship, or research. Though the University of Alabama in Huntsville Archives and Special Collections has physical ownership of the material in its collections, in some cases we may not own the copyright to the material. It is the patron's obligation to determine and satisfy copyright restrictions when publishing or otherwise distributing materials found in our collections.",uah_uahp_soccer_2021_05,,,,,,,,,,,,,,,,,,,,,,,,,,,,,,,,,,,,,,,,,,,,,,,,,,,,,,,,,,,,,,,,,,,,,,,,,,,,,,,http://libarchstor2.uah.edu/digitalcollections/files/original/40/4781/uah_uahp_000503.pdf,,"UAH Photograph Collection",1,0
4780,http://libarchstor2.uah.edu/digitalcollections/items/show/4780,uah_uahp_000502,"Action shot from UAH men's soccer game.",,"Milo Boering (4) shown.","Keim, Dennis",,1992,1990-1999,,,"College sports^^Soccer matches^^Soccer teams^^University of Alabama in Huntsville^^Huntsville (Ala.)^^Madison County (Ala.)","Still Image^^Photographs",Prints,"UAH Photographs",,,,en,"This material may be protected under U. S. Copyright Law (Title 17, U.S. Code) which governs the making of photocopies or reproductions of copyrighted materials. You may use the digitized material for private study, scholarship, or research. Though the University of Alabama in Huntsville Archives and Special Collections has physical ownership of the material in its collections, in some cases we may not own the copyright to the material. It is the patron's obligation to determine and satisfy copyright restrictions when publishing or otherwise distributing materials found in our collections.",uah_uahp_soccer_2021_05,,,,,,,,,,,,,,,,,,,,,,,,,,,,,,,,,,,,,,,,,,,,,,,,,,,,,,,,,,,,,,,,,,,,,,,,,,,,,,,http://libarchstor2.uah.edu/digitalcollections/files/original/40/4780/uah_uahp_000502.pdf,,"UAH Photograph Collection",1,0
4779,http://libarchstor2.uah.edu/digitalcollections/items/show/4779,uah_uahp_000501,"Action shot from UAH men's soccer game.",,"Milo Boering (4) shown.","Keim, Dennis",,1992,1990-1999,,,"College sports^^Soccer matches^^Soccer teams^^University of Alabama in Huntsville^^Huntsville (Ala.)^^Madison County (Ala.)","Still Image^^Photographs",Prints,"UAH Photographs",,,,en,"This material may be protected under U. S. Copyright Law (Title 17, U.S. Code) which governs the making of photocopies or reproductions of copyrighted materials. You may use the digitized material for private study, scholarship, or research. Though the University of Alabama in Huntsville Archives and Special Collections has physical ownership of the material in its collections, in some cases we may not own the copyright to the material. It is the patron's obligation to determine and satisfy copyright restrictions when publishing or otherwise distributing materials found in our collections.",uah_uahp_soccer_2021_05,,,,,,,,,,,,,,,,,,,,,,,,,,,,,,,,,,,,,,,,,,,,,,,,,,,,,,,,,,,,,,,,,,,,,,,,,,,,,,,http://libarchstor2.uah.edu/digitalcollections/files/original/40/4779/uah_uahp_000501.pdf,,"UAH Photograph Collection",1,0
4778,http://libarchstor2.uah.edu/digitalcollections/items/show/4778,uah_uahp_000500,"Chris Maltezos makes a save during men's soccer game vs. Bellarmine University.",,"UAH player Chris O'Halloran (9) is also in the shot, at right.","University of Alabama in Huntsville",,1992,1990-1999,,,"College sports^^Soccer matches^^Soccer teams^^University of Alabama in Huntsville^^Huntsville (Ala.)^^Madison County (Ala.)","Still Image^^Photographs",Prints,"UAH Photographs",,,,en,"This material may be protected under U. S. Copyright Law (Title 17, U.S. Code) which governs the making of photocopies or reproductions of copyrighted materials. You may use the digitized material for private study, scholarship, or research. Though the University of Alabama in Huntsville Archives and Special Collections has physical ownership of the material in its collections, in some cases we may not own the copyright to the material. It is the patron's obligation to determine and satisfy copyright restrictions when publishing or otherwise distributing materials found in our collections.",uah_uahp_soccer_2021_05,,,,,,,,,,,,,,,,,,,,,,,,,,,,,,,,,,,,,,,,,,,,,,,,,,,,,,,,,,,,,,,,,,,,,,,,,,,,,,,http://libarchstor2.uah.edu/digitalcollections/files/original/40/4778/uah_uahp_000500.pdf,,"UAH Photograph Collection",1,0
