﻿"Item Id","Item URI","Dublin Core:Identifier","Dublin Core:Title","Dublin Core:Alternative Title","Dublin Core:Description","Dublin Core:Creator","Dublin Core:Publisher","Dublin Core:Date","Dublin Core:Temporal Coverage","Dublin Core:Coverage","Dublin Core:Spatial Coverage","Dublin Core:Subject","Dublin Core:Type","Dublin Core:Format","Dublin Core:Source","Dublin Core:Is Part Of","Dublin Core:Has Format","Dublin Core:Provenance","Dublin Core:Language","Dublin Core:Rights","Dublin Core:Relation","Dublin Core:Contributor","Dublin Core:Abstract","Dublin Core:Table Of Contents","Dublin Core:Date Available","Dublin Core:Date Created","Dublin Core:Date Accepted","Dublin Core:Date Copyrighted","Dublin Core:Date Submitted","Dublin Core:Date Issued","Dublin Core:Date Modified","Dublin Core:Date Valid","Dublin Core:Access Rights","Dublin Core:License","Dublin Core:Conforms To","Dublin Core:Has Part","Dublin Core:Has Version","Dublin Core:Is Format Of","Dublin Core:Is Referenced By","Dublin Core:Is Replaced By","Dublin Core:Is Required By","Dublin Core:Is Version Of","Dublin Core:References","Dublin Core:Replaces","Dublin Core:Requires","Dublin Core:Extent","Dublin Core:Medium","Dublin Core:Bibliographic Citation","Dublin Core:Accrual Method","Dublin Core:Accrual Periodicity","Dublin Core:Accrual Policy","Dublin Core:Audience","Dublin Core:Audience Education Level","Dublin Core:Mediator","Dublin Core:Instructional Method","Dublin Core:Rights Holder","Item Type Metadata:Text","Item Type Metadata:Interviewer","Item Type Metadata:Interviewee","Item Type Metadata:Location","Item Type Metadata:Transcription","Item Type Metadata:Local URL","Item Type Metadata:Original Format","Item Type Metadata:Physical Dimensions","Item Type Metadata:Duration","Item Type Metadata:Compression","Item Type Metadata:Producer","Item Type Metadata:Director","Item Type Metadata:Bit Rate/Frequency","Item Type Metadata:Time Summary","Item Type Metadata:Email Body","Item Type Metadata:Subject Line","Item Type Metadata:From","Item Type Metadata:To","Item Type Metadata:CC","Item Type Metadata:BCC","Item Type Metadata:Number of Attachments","Item Type Metadata:Standards","Item Type Metadata:Objectives","Item Type Metadata:Materials","Item Type Metadata:Lesson Plan Text","Item Type Metadata:URL","Item Type Metadata:Event Type","Item Type Metadata:Participants","Item Type Metadata:Birth Date","Item Type Metadata:Birthplace","Item Type Metadata:Death Date","Item Type Metadata:Occupation","Item Type Metadata:Biographical Text","Item Type Metadata:Bibliography","Item Type Metadata:Player","Item Type Metadata:Imported Thumbnail","Item Type Metadata:OHMS Object","Item Type Metadata:OHMS Object Text","Item Type Metadata:Interview Keyword","Item Type Metadata:Sort Priority","PDF Text:Text",Scripto:Transcription,tags,file,itemType,collection,public,featured
1468,http://libarchstor2.uah.edu/digitalcollections/items/show/1468,spc_stnv_000008_01^^spc_stnv_000008_02^^MC_2_004,"Interviews with Sawyer and Kudebeh (Rocketdyne?).",,"Interviews with Sawyer (0 - 16:58 S1) and Kudebeh (16:58 S1 - end S2) on weight penalties, schedule/performance bonuses, and project management.","United States. National Aeronautics and Space Administration^^University of Alabama in Huntsville",,,,,,"United States. National Aeronautics and Space Administration^^Project Apollo (U.S.)^^Skylab Program^^George C. Marshall Space Flight Center",Interviews^^Audio,Audiocassettes,"Saturn V Collection^^University of Alabama in Huntsville Archives, Special Collections, and Digital Initiatives, Huntsville, Alabama",,,,en,"This material may be protected under U. S. Copyright Law (Title 17, U.S. Code) which governs the making of photocopies or reproductions of copyrighted materials. You may use the digitized material for private study, scholarship, or research. Though the University of Alabama in Huntsville Archives and Special Collections has physical ownership of the material in its collections, in some cases we may not own the copyright to the material. It is the patron's obligation to determine and satisfy copyright restrictions when publishing or otherwise distributing materials found in our collections.",clir_grant_audio_metadata,,,,,,,,,,,,,,,,,,,,,,,,,,,,,,,,,,,,,,,,,,,,0:58:24,,,,,,,,,,,,,,,,,,,,,,,,,,,,,,,,,,"Oral History","http://libarchstor2.uah.edu/digitalcollections/files/original/20/1468/spc_stnv_000008_01.mp3,http://libarchstor2.uah.edu/digitalcollections/files/original/20/1468/spc_stnv_000008_02.mp3","Oral History","Saturn V Collection",1,0
14291,http://libarchstor2.uah.edu/digitalcollections/items/show/14291,spc_skyl_001170_001188,"Skylab Neutral Buoyancy Testing.",,"The images depict the Skylab neutral buoyancy tests.","United States. National Aeronautics and Space Administration",,,1970-1979,,,"Gibson, Edward G.^^Kerwin, Joseph P.^^Musgrave, Story^^McDonnell Douglas Corporation^^Skylab Program^^Spacecraft electronic equipment^^Onboard equipment^^Experimentation^^Neutral buoyancy simulation^^Film Vault",Photographs^^Image,,"Skylab Photos^^Box 3, Folder 4^^University of Alabama in Huntsville Archives and Special Collections, Huntsville, Alabama",,,,en,"This material may be protected under U. S. Copyright Law (Title 17, U.S. Code) which governs the making of photocopies or reproductions of copyrighted materials. You may use the digitized material for private study, scholarship, or research. Though the University of Alabama in Huntsville Archives and Special Collections has physical ownership of the material in its collections, in some cases we may not own the copyright to the material. It is the patron's obligation to determine and satisfy copyright restrictions when publishing or otherwise distributing materials found in our collections.",spc_skyl_spc_skyl_000005_001188,,,,,,,,,,,,,,,,,,,,,,,,,,,,,,,,,,,,,,,,,,,,,,,,,,,,,,,,,,,,,,,,,,,,,,,,,,,,,,"Skylab 50th Anniversary",http://libarchstor2.uah.edu/digitalcollections/files/original/21/14291/spc_skyl_001170_001188.pdf,,"Skylab Collection",1,0
14290,http://libarchstor2.uah.edu/digitalcollections/items/show/14290,spc_skyl_001116_001169,"Skylab Testing and Equipment.",,"The images depict the Skylab neutral buoyancy tests. The images depict the Skylab equipment tests.","United States. National Aeronautics and Space Administration",,,1970-1979,,,"Conrad, Charles, Jr.^^Gibson, Edward G.^^Kerwin, Joseph P.^^Musgrave, Story^^Schweickart, Russell L.^^McDonnell Douglas Corporation^^Skylab Program^^Spacecraft electronic equipment^^Onboard equipment^^Experimentation^^Neutral buoyancy simulation^^Film Vault",Photographs^^Image,,"Skylab Photos^^Box 3, Folder 3^^University of Alabama in Huntsville Archives and Special Collections, Huntsville, Alabama",,,,en,"This material may be protected under U. S. Copyright Law (Title 17, U.S. Code) which governs the making of photocopies or reproductions of copyrighted materials. You may use the digitized material for private study, scholarship, or research. Though the University of Alabama in Huntsville Archives and Special Collections has physical ownership of the material in its collections, in some cases we may not own the copyright to the material. It is the patron's obligation to determine and satisfy copyright restrictions when publishing or otherwise distributing materials found in our collections.",spc_skyl_spc_skyl_000005_001188,,,,,,,,,,,,,,,,,,,,,,,,,,,,,,,,,,,,,,,,,,,,,,,,,,,,,,,,,,,,,,,,,,,,,,,,,,,,,,"Skylab 50th Anniversary",http://libarchstor2.uah.edu/digitalcollections/files/original/21/14290/spc_skyl_001116_001169.pdf,,"Skylab Collection",1,0
14289,http://libarchstor2.uah.edu/digitalcollections/items/show/14289,spc_skyl_001096_001115,"Skylab External Views.",,"The images depict external views of the Skylab habitat. The images depict external views of the instillation of Skylab Electronic Systems. The images depict external views of Skylab life support systems.","United States. National Aeronautics and Space Administration",,,1970-1979,,,"Skylab Program^^Spacecraft electronic equipment^^Life support systems^^Space habitats^^Film Vault",Photographs^^Image,,"Skylab Photos^^Box 3, Folder 2^^University of Alabama in Huntsville Archives and Special Collections, Huntsville, Alabama",,,,en,"This material may be protected under U. S. Copyright Law (Title 17, U.S. Code) which governs the making of photocopies or reproductions of copyrighted materials. You may use the digitized material for private study, scholarship, or research. Though the University of Alabama in Huntsville Archives and Special Collections has physical ownership of the material in its collections, in some cases we may not own the copyright to the material. It is the patron's obligation to determine and satisfy copyright restrictions when publishing or otherwise distributing materials found in our collections.",spc_skyl_spc_skyl_000005_001188,,,,,,,,,,,,,,,,,,,,,,,,,,,,,,,,,,,,,,,,,,,,,,,,,,,,,,,,,,,,,,,,,,,,,,,,,,,,,,"Skylab 50th Anniversary",http://libarchstor2.uah.edu/digitalcollections/files/original/21/14289/spc_skyl_001096_001115.pdf,,"Skylab Collection",1,0
14288,http://libarchstor2.uah.edu/digitalcollections/items/show/14288,spc_skyl_001069_001095,"Skylab External Views.",,"The images depict external views of the Skylab habitat. The images depict external views of the Skylab electronic systems.","United States. National Aeronautics and Space Administration",,,1970-1979,,,"Gibson, Edward G.^^Musgrave, Story^^McDonnell Douglas Corporation^^Skylab Program^^Spacecraft electronic equipment^^Space habitats",Photographs^^Image,,"Skylab Photos^^Box 3, Folder 1^^University of Alabama in Huntsville Archives and Special Collections, Huntsville, Alabama",,,,en,"This material may be protected under U. S. Copyright Law (Title 17, U.S. Code) which governs the making of photocopies or reproductions of copyrighted materials. You may use the digitized material for private study, scholarship, or research. Though the University of Alabama in Huntsville Archives and Special Collections has physical ownership of the material in its collections, in some cases we may not own the copyright to the material. It is the patron's obligation to determine and satisfy copyright restrictions when publishing or otherwise distributing materials found in our collections.",spc_skyl_spc_skyl_000005_001188,,,,,,,,,,,,,,,,,,,,,,,,,,,,,,,,,,,,,,,,,,,,,,,,,,,,,,,,,,,,,,,,,,,,,,,,,,,,,,"Skylab 50th Anniversary",http://libarchstor2.uah.edu/digitalcollections/files/original/21/14288/spc_skyl_001069_001095.pdf,,"Skylab Collection",1,0
14287,http://libarchstor2.uah.edu/digitalcollections/items/show/14287,spc_skyl_001033_001068,"Skylab Human Factors Systems.",,"The images depict the Skylab waste disposal systems. The images depict the Skylab provision storage systems. The images depict the Skylab sleeping compartments.","United States. National Aeronautics and Space Administration",,,1970-1979,,,"Skylab Program^^Human factors in engineering design^^Provisioning^^Space habitats",Photographs^^Image,,"Skylab Photos^^Box 2, Folder 14^^University of Alabama in Huntsville Archives and Special Collections, Huntsville, Alabama",,,,en,"This material may be protected under U. S. Copyright Law (Title 17, U.S. Code) which governs the making of photocopies or reproductions of copyrighted materials. You may use the digitized material for private study, scholarship, or research. Though the University of Alabama in Huntsville Archives and Special Collections has physical ownership of the material in its collections, in some cases we may not own the copyright to the material. It is the patron's obligation to determine and satisfy copyright restrictions when publishing or otherwise distributing materials found in our collections.",spc_skyl_spc_skyl_000005_001188,,,,,,,,,,,,,,,,,,,,,,,,,,,,,,,,,,,,,,,,,,,,,,,,,,,,,,,,,,,,,,,,,,,,,,,,,,,,,,"Skylab 50th Anniversary",http://libarchstor2.uah.edu/digitalcollections/files/original/21/14287/spc_skyl_001033_001068.pdf,,"Skylab Collection",1,0
14286,http://libarchstor2.uah.edu/digitalcollections/items/show/14286,spc_skyl_001003_001032,"Skylab Stowage Systems.",,,"United States. National Aeronautics and Space Administration",,,1970-1979,,,"Skylab Program^^Human factors in engineering design^^Onboard equipment^^Provisioning^^Experimentation^^Space habitats",Photographs^^Image,,"Skylab Photos^^Box 2, Folder 13^^University of Alabama in Huntsville Archives and Special Collections, Huntsville, Alabama",,,,en,"This material may be protected under U. S. Copyright Law (Title 17, U.S. Code) which governs the making of photocopies or reproductions of copyrighted materials. You may use the digitized material for private study, scholarship, or research. Though the University of Alabama in Huntsville Archives and Special Collections has physical ownership of the material in its collections, in some cases we may not own the copyright to the material. It is the patron's obligation to determine and satisfy copyright restrictions when publishing or otherwise distributing materials found in our collections.",spc_skyl_spc_skyl_000005_001188,,,,,,,,,,,,,,,,,,,,,,,,,,,,,,,,,,,,,,,,,,,,,,,,,,,,,,,,,,,,,,,,,,,,,,,,,,,,,,"Skylab 50th Anniversary",http://libarchstor2.uah.edu/digitalcollections/files/original/21/14286/spc_skyl_001003_001032.pdf,,"Skylab Collection",1,0
14285,http://libarchstor2.uah.edu/digitalcollections/items/show/14285,spc_skyl_000974_001002,"Skylab Habitat Urine and Fecal Processing Systems.",,"The images depict the Skylab urine freezing and preservation systems. The images depict the Skylab fecal collection systems. The images depict the Skylab wastewater disposal system.","United States. National Aeronautics and Space Administration",,,1970-1979,,,"McDonnell Douglas Corporation^^Skylab Program^^Human factors in engineering design^^Onboard equipment^^Experimentation^^Space habitats",Photographs^^Image,,"Skylab Photos^^Box 2, Folder 12^^University of Alabama in Huntsville Archives and Special Collections, Huntsville, Alabama",,,,en,"This material may be protected under U. S. Copyright Law (Title 17, U.S. Code) which governs the making of photocopies or reproductions of copyrighted materials. You may use the digitized material for private study, scholarship, or research. Though the University of Alabama in Huntsville Archives and Special Collections has physical ownership of the material in its collections, in some cases we may not own the copyright to the material. It is the patron's obligation to determine and satisfy copyright restrictions when publishing or otherwise distributing materials found in our collections.",spc_skyl_spc_skyl_000005_001188,,,,,,,,,,,,,,,,,,,,,,,,,,,,,,,,,,,,,,,,,,,,,,,,,,,,,,,,,,,,,,,,,,,,,,,,,,,,,,"Skylab 50th Anniversary",http://libarchstor2.uah.edu/digitalcollections/files/original/21/14285/spc_skyl_000974_001002.pdf,,"Skylab Collection",1,0
14284,http://libarchstor2.uah.edu/digitalcollections/items/show/14284,spc_skyl_000938_000973,"Skylab Habitat Food Preparation Area Systems.",,"The images depict the Skylab food preparation table. The images depict the Skylab food storage systems.","United States. National Aeronautics and Space Administration",,,1970-1979,,,"McDonnell Douglas Corporation^^Skylab Program^^Human factors in engineering design^^Provisioning^^Life support systems^^Space habitats",Photographs^^Image,,"Skylab Photos^^Box 2, Folder 11^^University of Alabama in Huntsville Archives and Special Collections, Huntsville, Alabama",,,,en,"This material may be protected under U. S. Copyright Law (Title 17, U.S. Code) which governs the making of photocopies or reproductions of copyrighted materials. You may use the digitized material for private study, scholarship, or research. Though the University of Alabama in Huntsville Archives and Special Collections has physical ownership of the material in its collections, in some cases we may not own the copyright to the material. It is the patron's obligation to determine and satisfy copyright restrictions when publishing or otherwise distributing materials found in our collections.",spc_skyl_spc_skyl_000005_001188,,,,,,,,,,,,,,,,,,,,,,,,,,,,,,,,,,,,,,,,,,,,,,,,,,,,,,,,,,,,,,,,,,,,,,,,,,,,,,"Skylab 50th Anniversary",http://libarchstor2.uah.edu/digitalcollections/files/original/21/14284/spc_skyl_000938_000973.pdf,,"Skylab Collection",1,0
14283,http://libarchstor2.uah.edu/digitalcollections/items/show/14283,spc_skyl_000913_000937,"Skylab Unrefrigerated Storage Systems.",,"The images depict the Skylab refrigerated & unrefrigerated food storage stystem. The images depict the Skylab unrefrigerated non-food provision storage, including storage for medical supplies and storage for washcloths.","United States. National Aeronautics and Space Administration",,,1970-1979,,,"Skylab Program^^Human factors in engineering design^^Provisioning^^Space habitats",Photographs^^Image,,"Skylab Photos^^Box 2, Folder 10^^University of Alabama in Huntsville Archives and Special Collections, Huntsville, Alabama",,,,en,"This material may be protected under U. S. Copyright Law (Title 17, U.S. Code) which governs the making of photocopies or reproductions of copyrighted materials. You may use the digitized material for private study, scholarship, or research. Though the University of Alabama in Huntsville Archives and Special Collections has physical ownership of the material in its collections, in some cases we may not own the copyright to the material. It is the patron's obligation to determine and satisfy copyright restrictions when publishing or otherwise distributing materials found in our collections.",spc_skyl_spc_skyl_000005_001188,,,,,,,,,,,,,,,,,,,,,,,,,,,,,,,,,,,,,,,,,,,,,,,,,,,,,,,,,,,,,,,,,,,,,,,,,,,,,,"Skylab 50th Anniversary",http://libarchstor2.uah.edu/digitalcollections/files/original/21/14283/spc_skyl_000913_000937.pdf,,"Skylab Collection",1,0
