﻿"Item Id","Item URI","Dublin Core:Identifier","Dublin Core:Title","Dublin Core:Alternative Title","Dublin Core:Description","Dublin Core:Creator","Dublin Core:Publisher","Dublin Core:Date","Dublin Core:Temporal Coverage","Dublin Core:Coverage","Dublin Core:Spatial Coverage","Dublin Core:Subject","Dublin Core:Type","Dublin Core:Format","Dublin Core:Source","Dublin Core:Is Part Of","Dublin Core:Has Format","Dublin Core:Provenance","Dublin Core:Language","Dublin Core:Rights","Dublin Core:Relation","Dublin Core:Contributor","Dublin Core:Abstract","Dublin Core:Table Of Contents","Dublin Core:Date Available","Dublin Core:Date Created","Dublin Core:Date Accepted","Dublin Core:Date Copyrighted","Dublin Core:Date Submitted","Dublin Core:Date Issued","Dublin Core:Date Modified","Dublin Core:Date Valid","Dublin Core:Access Rights","Dublin Core:License","Dublin Core:Conforms To","Dublin Core:Has Part","Dublin Core:Has Version","Dublin Core:Is Format Of","Dublin Core:Is Referenced By","Dublin Core:Is Replaced By","Dublin Core:Is Required By","Dublin Core:Is Version Of","Dublin Core:References","Dublin Core:Replaces","Dublin Core:Requires","Dublin Core:Extent","Dublin Core:Medium","Dublin Core:Bibliographic Citation","Dublin Core:Accrual Method","Dublin Core:Accrual Periodicity","Dublin Core:Accrual Policy","Dublin Core:Audience","Dublin Core:Audience Education Level","Dublin Core:Mediator","Dublin Core:Instructional Method","Dublin Core:Rights Holder","Item Type Metadata:Text","Item Type Metadata:Interviewer","Item Type Metadata:Interviewee","Item Type Metadata:Location","Item Type Metadata:Transcription","Item Type Metadata:Local URL","Item Type Metadata:Original Format","Item Type Metadata:Physical Dimensions","Item Type Metadata:Duration","Item Type Metadata:Compression","Item Type Metadata:Producer","Item Type Metadata:Director","Item Type Metadata:Bit Rate/Frequency","Item Type Metadata:Time Summary","Item Type Metadata:Email Body","Item Type Metadata:Subject Line","Item Type Metadata:From","Item Type Metadata:To","Item Type Metadata:CC","Item Type Metadata:BCC","Item Type Metadata:Number of Attachments","Item Type Metadata:Standards","Item Type Metadata:Objectives","Item Type Metadata:Materials","Item Type Metadata:Lesson Plan Text","Item Type Metadata:URL","Item Type Metadata:Event Type","Item Type Metadata:Participants","Item Type Metadata:Birth Date","Item Type Metadata:Birthplace","Item Type Metadata:Death Date","Item Type Metadata:Occupation","Item Type Metadata:Biographical Text","Item Type Metadata:Bibliography","Item Type Metadata:Player","Item Type Metadata:Imported Thumbnail","Item Type Metadata:OHMS Object","Item Type Metadata:OHMS Object Text","Item Type Metadata:Interview Keyword","Item Type Metadata:Sort Priority","PDF Text:Text",Scripto:Transcription,tags,file,itemType,collection,public,featured
5542,http://libarchstor2.uah.edu/digitalcollections/items/show/5542,loc_burw_1174,"Men playing football at Camp Shanks in New York. ",,,"Burwell, Edwin D. III [Burwell, Edwin D., Jr.]",,1944,1940-1949,,,"Football^^Military camps^^World War, 1939-1945--Military life^^Camp Shanks (N.Y.)","Photographs^^Still Image^^black-and-white prints",,"Burwell Family Collection^^University of Alabama in Huntsville Archives, Special Collections, and Digital Initiatives, Huntsville, Alabama",,,"This item was generously digitized by Dudley Burwell.",en,"This material may be protected under U. S. Copyright Law (Title 17, U.S. Code) which governs the making of photocopies or reproductions of copyrighted materials. You may use the digitized material for private study, scholarship, or research. Though the University of Alabama in Huntsville Archives and Special Collections has physical ownership of the material in its collections, in some cases we may not own the copyright to the material. It is the patron's obligation to determine and satisfy copyright restrictions when publishing or otherwise distributing materials found in our collections.",loc_burw_2021_05,,,,,,,,,,,,,,,,,,,,,,,,,,,,,,,,,,,,,,,,,,,,,,,,,,,,,,,,,,,,,,,,,,,,,,,,,,,,,,,http://libarchstor2.uah.edu/digitalcollections/files/original/76/5542/Loc_burw-1174.pdf,,"Burwell Family Collection",1,0
5516,http://libarchstor2.uah.edu/digitalcollections/items/show/5516,loc_burw_1148,"Office scene, probably at Fort Gordon, Ga.",,"Edwin D. Burwell, Jr. was stationed at Fort Gordon, Ga. in mid-1944 and joined the 1147th Combat Engineers for training in the Carolina maneuver area.","Burwell, Edwin D. III [Burwell, Edwin D., Jr.]",,1944-07,1940-1949,,,"Military camps^^Fort Gordon (Ga.)^^World War, 1939-1945--Military personnel^^Military training camps","Photographs^^Still Image^^black-and-white prints",,"Burwell Family Collection^^University of Alabama in Huntsville Archives, Special Collections, and Digital Initiatives, Huntsville, Alabama",,,"This item was generously digitized by Dudley Burwell.",en,"This material may be protected under U. S. Copyright Law (Title 17, U.S. Code) which governs the making of photocopies or reproductions of copyrighted materials. You may use the digitized material for private study, scholarship, or research. Though the University of Alabama in Huntsville Archives and Special Collections has physical ownership of the material in its collections, in some cases we may not own the copyright to the material. It is the patron's obligation to determine and satisfy copyright restrictions when publishing or otherwise distributing materials found in our collections.",loc_burw_2021_05,,,,,,,,,,,,,,,,,,,,,,,,,,,,,,,,,,,,,,,,,,,,,,,,,,,,,,,,,,,,,,,,,,,,,,,,,,,,,,,http://libarchstor2.uah.edu/digitalcollections/files/original/76/5516/Loc_burw-1148.pdf,,"Burwell Family Collection",1,0
5515,http://libarchstor2.uah.edu/digitalcollections/items/show/5515,loc_burw_1147,"Man working in an office, probably at Fort Gordon, Ga.",,"Edwin D. Burwell, Jr. was stationed at Fort Gordon, Ga. in mid-1944 and joined the 1147th Combat Engineers for training in the Carolina maneuver area.","Burwell, Edwin D. III [Burwell, Edwin D., Jr.]",,1944-07,1940-1949,,,"Military camps^^Fort Gordon (Ga.)^^World War, 1939-1945--Military personnel^^Military training camps^^World War, 1939-1945--Military personnel","Photographs^^Still Image^^black-and-white prints",,"Burwell Family Collection^^University of Alabama in Huntsville Archives, Special Collections, and Digital Initiatives, Huntsville, Alabama",,,"This item was generously digitized by Dudley Burwell.",en,"This material may be protected under U. S. Copyright Law (Title 17, U.S. Code) which governs the making of photocopies or reproductions of copyrighted materials. You may use the digitized material for private study, scholarship, or research. Though the University of Alabama in Huntsville Archives and Special Collections has physical ownership of the material in its collections, in some cases we may not own the copyright to the material. It is the patron's obligation to determine and satisfy copyright restrictions when publishing or otherwise distributing materials found in our collections.",loc_burw_2021_05,,,,,,,,,,,,,,,,,,,,,,,,,,,,,,,,,,,,,,,,,,,,,,,,,,,,,,,,,,,,,,,,,,,,,,,,,,,,,,,http://libarchstor2.uah.edu/digitalcollections/files/original/76/5515/Loc_burw-1147.pdf,,"Burwell Family Collection",1,0
6470,http://libarchstor2.uah.edu/digitalcollections/items/show/6470," loc_burw_2023","Soldiers bathing outdoors at a National Guard camp.",,"This photograph was likely taken during Alabama Army National Guard field training exercises at Fort McClellan, near Anniston, Alabama.","Burwell, Edwin D. III [Burwell, Edwin D., Jr.]",,1949,1940-1949,,,"Military camps^^Soldiers--United States^^United States--National Guard","Photographs^^Still Image","Glass slides^^Glass transparencies","Burwell Family Collection^^University of Alabama in Huntsville Archives, Special Collections, and Digital Initiatives, Huntsville, Alabama",,,"This item was generously digitized by Dudley Burwell.",en,"This material may be protected under U. S. Copyright Law (Title 17, U.S. Code) which governs the making of photocopies or reproductions of copyrighted materials. You may use the digitized material for private study, scholarship, or research. Though the University of Alabama in Huntsville Archives and Special Collections has physical ownership of the material in its collections, in some cases we may not own the copyright to the material. It is the patron's obligation to determine and satisfy copyright restrictions when publishing or otherwise distributing materials found in our collections.",loc_burw_2021_06,,,,,,,,,,,,,,,,,,,,,,,,,,,,,,,,,,,,,,,,,,,,,,,,,,,,,,,,,,,,,,,,,,,,,,,,,,,,,,,http://libarchstor2.uah.edu/digitalcollections/files/original/76/6470/Loc_burw-2023.pdf,"Still Image","Burwell Family Collection",1,0
6469,http://libarchstor2.uah.edu/digitalcollections/items/show/6469," loc_burw_2022","Bivouac site at a National Guard camp.",,"This photograph was likely taken during Alabama Army National Guard field training exercises at Fort McClellan, near Anniston, Alabama.","Burwell, Edwin D. III [Burwell, Edwin D., Jr.]",,1949,1940-1949,,,"Military camps^^Soldiers--United States^^United States--National Guard","Photographs^^Still Image","Glass slides ^^Glass transparencies","Burwell Family Collection^^University of Alabama in Huntsville Archives, Special Collections, and Digital Initiatives, Huntsville, Alabama",,,"This item was generously digitized by Dudley Burwell.",en,"This material may be protected under U. S. Copyright Law (Title 17, U.S. Code) which governs the making of photocopies or reproductions of copyrighted materials. You may use the digitized material for private study, scholarship, or research. Though the University of Alabama in Huntsville Archives and Special Collections has physical ownership of the material in its collections, in some cases we may not own the copyright to the material. It is the patron's obligation to determine and satisfy copyright restrictions when publishing or otherwise distributing materials found in our collections.",loc_burw_2021_06,,,,,,,,,,,,,,,,,,,,,,,,,,,,,,,,,,,,,,,,,,,,,,,,,,,,,,,,,,,,,,,,,,,,,,,,,,,,,,,http://libarchstor2.uah.edu/digitalcollections/files/original/76/6469/Loc_burw-2022.pdf,,"Burwell Family Collection",1,0
6468,http://libarchstor2.uah.edu/digitalcollections/items/show/6468," loc_burw_2021","Outdoor shower at a National Guard camp.",,"This photograph was likely taken during Alabama Army National Guard field training exercises at Fort McClellan, near Anniston, Alabama.","Burwell, Edwin D. III [Burwell, Edwin D., Jr.]",,1949,1940-1949,,,"Military camps^^Soldiers--United States^^United States--National Guard","Photographs^^Still Image","Glass slides^^Glass transparencies","Burwell Family Collection^^University of Alabama in Huntsville Archives, Special Collections, and Digital Initiatives, Huntsville, Alabama",,,"This item was generously digitized by Dudley Burwell.",en,"This material may be protected under U. S. Copyright Law (Title 17, U.S. Code) which governs the making of photocopies or reproductions of copyrighted materials. You may use the digitized material for private study, scholarship, or research. Though the University of Alabama in Huntsville Archives and Special Collections has physical ownership of the material in its collections, in some cases we may not own the copyright to the material. It is the patron's obligation to determine and satisfy copyright restrictions when publishing or otherwise distributing materials found in our collections.",loc_burw_2021_06,,,,,,,,,,,,,,,,,,,,,,,,,,,,,,,,,,,,,,,,,,,,,,,,,,,,,,,,,,,,,,,,,,,,,,,,,,,,,,,http://libarchstor2.uah.edu/digitalcollections/files/original/76/6468/Loc_burw-2021.pdf,,"Burwell Family Collection",1,0
6467,http://libarchstor2.uah.edu/digitalcollections/items/show/6467," loc_burw_2020","Unidentified master sergeant under orange trees at a National Guard camp.",,"This photograph was likely taken during Army National Guard field training exercises.","Burwell, Edwin D. III [Burwell, Edwin D., Jr.]",,1949,1940-1949,,,"Military camps^^Soldiers--United States^^United States--Armed Forces--Non-commissioned officers^^United States--National Guard","Photographs^^Still Image","Glass slides ^^Glass transparencies","Burwell Family Collection^^University of Alabama in Huntsville Archives, Special Collections, and Digital Initiatives, Huntsville, Alabama",,,"This item was generously digitized by Dudley Burwell.",en,"This material may be protected under U. S. Copyright Law (Title 17, U.S. Code) which governs the making of photocopies or reproductions of copyrighted materials. You may use the digitized material for private study, scholarship, or research. Though the University of Alabama in Huntsville Archives and Special Collections has physical ownership of the material in its collections, in some cases we may not own the copyright to the material. It is the patron's obligation to determine and satisfy copyright restrictions when publishing or otherwise distributing materials found in our collections.",loc_burw_2021_06,,,,,,,,,,,,,,,,,,,,,,,,,,,,,,,,,,,,,,,,,,,,,,,,,,,,,,,,,,,,,,,,,,,,,,,,,,,,,,,http://libarchstor2.uah.edu/digitalcollections/files/original/76/6467/Loc_burw-2020.pdf,,"Burwell Family Collection",1,0
6466,http://libarchstor2.uah.edu/digitalcollections/items/show/6466," loc_burw_2019","Bivouac site at a National Guard camp.",,"This photograph was likely taken during Alabama Army National Guard field training exercises at Fort McClellan, near Anniston, Alabama.","Burwell, Edwin D. III [Burwell, Edwin D., Jr.]",,1949,1940-1949,,,"Military camps^^Soldiers--United States^^United States--National Guard","Photographs^^Still Image","Glass slides ^^Glass transparencies","Burwell Family Collection^^University of Alabama in Huntsville Archives, Special Collections, and Digital Initiatives, Huntsville, Alabama",,,"This item was generously digitized by Dudley Burwell.",en,"This material may be protected under U. S. Copyright Law (Title 17, U.S. Code) which governs the making of photocopies or reproductions of copyrighted materials. You may use the digitized material for private study, scholarship, or research. Though the University of Alabama in Huntsville Archives and Special Collections has physical ownership of the material in its collections, in some cases we may not own the copyright to the material. It is the patron's obligation to determine and satisfy copyright restrictions when publishing or otherwise distributing materials found in our collections.",loc_burw_2021_06,,,,,,,,,,,,,,,,,,,,,,,,,,,,,,,,,,,,,,,,,,,,,,,,,,,,,,,,,,,,,,,,,,,,,,,,,,,,,,,http://libarchstor2.uah.edu/digitalcollections/files/original/76/6466/Loc_burw-2019.pdf,,"Burwell Family Collection",1,0
6465,http://libarchstor2.uah.edu/digitalcollections/items/show/6465," loc_burw_2018","Bivouac site at a National Guard camp.",,"This photograph was likely taken during Alabama Army National Guard field training exercises at Fort McClellan, near Anniston, Alabama.","Burwell, Edwin D. III [Burwell, Edwin D., Jr.]",,1949,1940-1949,,,"Military camps^^Soldiers--United States^^United States--National Guard","Photographs^^Still Image","Glass slides ^^Glass transparencies","Burwell Family Collection^^University of Alabama in Huntsville Archives, Special Collections, and Digital Initiatives, Huntsville, Alabama",,,"This item was generously digitized by Dudley Burwell.",en,"This material may be protected under U. S. Copyright Law (Title 17, U.S. Code) which governs the making of photocopies or reproductions of copyrighted materials. You may use the digitized material for private study, scholarship, or research. Though the University of Alabama in Huntsville Archives and Special Collections has physical ownership of the material in its collections, in some cases we may not own the copyright to the material. It is the patron's obligation to determine and satisfy copyright restrictions when publishing or otherwise distributing materials found in our collections.",loc_burw_2021_06,,,,,,,,,,,,,,,,,,,,,,,,,,,,,,,,,,,,,,,,,,,,,,,,,,,,,,,,,,,,,,,,,,,,,,,,,,,,,,,http://libarchstor2.uah.edu/digitalcollections/files/original/76/6465/Loc_burw-2018.pdf,,"Burwell Family Collection",1,0
6464,http://libarchstor2.uah.edu/digitalcollections/items/show/6464," loc_burw_2017","Soldiers at a bivouac site sharing a meal at a National Guard camp.",,"This photograph was likely taken during Alabama Army National Guard field training exercises at Fort McClellan, near Anniston, Alabama.","Burwell, Edwin D. III [Burwell, Edwin D., Jr.]",,1949,1940-1949,,,"Military camps^^Soldiers--United States^^United States--National Guard","Photographs^^Still Image","Glass slides ^^Glass transparencies","Burwell Family Collection^^University of Alabama in Huntsville Archives, Special Collections, and Digital Initiatives, Huntsville, Alabama",,,"This item was generously digitized by Dudley Burwell.",en,"This material may be protected under U. S. Copyright Law (Title 17, U.S. Code) which governs the making of photocopies or reproductions of copyrighted materials. You may use the digitized material for private study, scholarship, or research. Though the University of Alabama in Huntsville Archives and Special Collections has physical ownership of the material in its collections, in some cases we may not own the copyright to the material. It is the patron's obligation to determine and satisfy copyright restrictions when publishing or otherwise distributing materials found in our collections.",loc_burw_2021_06,,,,,,,,,,,,,,,,,,,,,,,,,,,,,,,,,,,,,,,,,,,,,,,,,,,,,,,,,,,,,,,,,,,,,,,,,,,,,,,http://libarchstor2.uah.edu/digitalcollections/files/original/76/6464/Loc_burw-2017.pdf,,"Burwell Family Collection",1,0
