﻿"Item Id","Item URI","Dublin Core:Identifier","Dublin Core:Title","Dublin Core:Alternative Title","Dublin Core:Description","Dublin Core:Creator","Dublin Core:Publisher","Dublin Core:Date","Dublin Core:Temporal Coverage","Dublin Core:Coverage","Dublin Core:Spatial Coverage","Dublin Core:Subject","Dublin Core:Type","Dublin Core:Format","Dublin Core:Source","Dublin Core:Is Part Of","Dublin Core:Has Format","Dublin Core:Provenance","Dublin Core:Language","Dublin Core:Rights","Dublin Core:Relation","Dublin Core:Contributor","Dublin Core:Abstract","Dublin Core:Table Of Contents","Dublin Core:Date Available","Dublin Core:Date Created","Dublin Core:Date Accepted","Dublin Core:Date Copyrighted","Dublin Core:Date Submitted","Dublin Core:Date Issued","Dublin Core:Date Modified","Dublin Core:Date Valid","Dublin Core:Access Rights","Dublin Core:License","Dublin Core:Conforms To","Dublin Core:Has Part","Dublin Core:Has Version","Dublin Core:Is Format Of","Dublin Core:Is Referenced By","Dublin Core:Is Replaced By","Dublin Core:Is Required By","Dublin Core:Is Version Of","Dublin Core:References","Dublin Core:Replaces","Dublin Core:Requires","Dublin Core:Extent","Dublin Core:Medium","Dublin Core:Bibliographic Citation","Dublin Core:Accrual Method","Dublin Core:Accrual Periodicity","Dublin Core:Accrual Policy","Dublin Core:Audience","Dublin Core:Audience Education Level","Dublin Core:Mediator","Dublin Core:Instructional Method","Dublin Core:Rights Holder","Item Type Metadata:Text","Item Type Metadata:Interviewer","Item Type Metadata:Interviewee","Item Type Metadata:Location","Item Type Metadata:Transcription","Item Type Metadata:Local URL","Item Type Metadata:Original Format","Item Type Metadata:Physical Dimensions","Item Type Metadata:Duration","Item Type Metadata:Compression","Item Type Metadata:Producer","Item Type Metadata:Director","Item Type Metadata:Bit Rate/Frequency","Item Type Metadata:Time Summary","Item Type Metadata:Email Body","Item Type Metadata:Subject Line","Item Type Metadata:From","Item Type Metadata:To","Item Type Metadata:CC","Item Type Metadata:BCC","Item Type Metadata:Number of Attachments","Item Type Metadata:Standards","Item Type Metadata:Objectives","Item Type Metadata:Materials","Item Type Metadata:Lesson Plan Text","Item Type Metadata:URL","Item Type Metadata:Event Type","Item Type Metadata:Participants","Item Type Metadata:Birth Date","Item Type Metadata:Birthplace","Item Type Metadata:Death Date","Item Type Metadata:Occupation","Item Type Metadata:Biographical Text","Item Type Metadata:Bibliography","Item Type Metadata:Player","Item Type Metadata:Imported Thumbnail","Item Type Metadata:OHMS Object","Item Type Metadata:OHMS Object Text","Item Type Metadata:Interview Keyword","Item Type Metadata:Sort Priority","PDF Text:Text",Scripto:Transcription,tags,file,itemType,collection,public,featured
10493,http://libarchstor2.uah.edu/digitalcollections/items/show/10493,SatuIWorkExpe_062508160355.pdf^^spc_stnv_000725,"""Saturn I workshop experiments.""",,"April 1, 1968.;   Stamped on first page is From the Archives of Frederick I. Ordway, III.","George C. Marshall Space Flight Center.  National Aeronautics & Space Administration",,1968-04-01,1960-1969,,,"Saturn project^^Space stations--Experiments^^Saturn 1 workshop^^Experimentation^^Apollo program^^AAP 1 mission",Text^^Reports,,"Saturn V Collection^^Box 26, Folder 17^^University of Alabama in Huntsville Archives, Special Collections, and Digital Initiatives, Huntsville, Alabama",,,,en,"This material may be protected under U. S. Copyright Law (Title 17, U.S. Code) which governs the making of photocopies or reproductions of copyrighted materials. You may use the digitized material for private study, scholarship, or research. Though the University of Alabama in Huntsville Archives and Special Collections has physical ownership of the material in its collections, in some cases we may not own the copyright to the material. It is the patron's obligation to determine and satisfy copyright restrictions when publishing or otherwise distributing materials found in our collections.",spc_stnv_000725_000749,,,,,,,,,,,,,,,,,,http://libarchstor.uah.edu:8081/repositories/2/archival_objects/17864,,,,,,,,,,,,,,,,,,,,,,,,,,,,,,,,,,,,,,,,,,,,,,,,,,,,,,,,,,,,,http://libarchstor2.uah.edu/digitalcollections/files/original/20/10493/SatuIWorkExpe_062508160355.pdf,,"Saturn V Collection",1,0
10906,http://libarchstor2.uah.edu/digitalcollections/items/show/10906,LettMSFCAttnDrWernVonBraun_090408155515.pdf^^spc_stnv_000383,"""Project High Water.""",,"Letter to Wernher von Braun from NASA headquarters regarding Project Highwater and how it was withheld.","Newell, Homer Edward",,1963-03-29,1960-1969,,,"Saturn project^^Apollo project^^Experimentation^^Upper atmosphere^^Saturn launch vehicles",Text^^Memorandum,,"Saturn V Collection^^University of Alabama in Huntsville Archives, Special Collections, and Digital Initiatives, Huntsville, Alabama",,,,en,"This material may be protected under U. S. Copyright Law (Title 17, U.S. Code) which governs the making of photocopies or reproductions of copyrighted materials. You may use the digitized material for private study, scholarship, or research. Though the University of Alabama in Huntsville Archives and Special Collections has physical ownership of the material in its collections, in some cases we may not own the copyright to the material. It is the patron's obligation to determine and satisfy copyright restrictions when publishing or otherwise distributing materials found in our collections.",spc_stnv_000375_000399,,,,,,,,,,,,,,,,,,,,,,,,,,,,,,,,,,,,,,,,,,,,,,,,,,,,,,,,,,,,,,,,,,,,,,,,,,,,,,,http://libarchstor2.uah.edu/digitalcollections/files/original/20/10906/LettMSFCAttnDrWernVonBraun_090408155515.pdf,,"Saturn V Collection",1,0
14254,http://libarchstor2.uah.edu/digitalcollections/items/show/14254,spc_skyl_000062_000086,"Internal Forward View of the Skylab Habitat.",,"The images depict the Skylab habitat from an internal forward view. The images depict the docking port and the docking tunnel. The images depict the stowage systems designed to hold experiments that would be carried out in space. The image depicts completed wiring systems.","United States. National Aeronautics and Space Administration",,,1970-1979,,,"McDonnell Douglas Corporation^^Skylab Program^^Airlock modules^^Multiple docking adapters^^Experimentation^^Spacecraft electronic equipment^^Space habitats^^Film Vault",Photographs^^Image,,"Skylab Photos^^Box 1, Folder 3^^University of Alabama in Huntsville Archives, Special Collections, and Digital Initiatives, Huntsville, Alabama",,,,en,"This material may be protected under U. S. Copyright Law (Title 17, U.S. Code) which governs the making of photocopies or reproductions of copyrighted materials. You may use the digitized material for private study, scholarship, or research. Though the University of Alabama in Huntsville Archives and Special Collections has physical ownership of the material in its collections, in some cases we may not own the copyright to the material. It is the patron's obligation to determine and satisfy copyright restrictions when publishing or otherwise distributing materials found in our collections.",spc_skyl_spc_skyl_000005_001188,,,,,,,,,,,,,,,,,,,,,,,,,,,,,,,,,,,,,,,,,,,,,,,,,,,,,,,,,,,,,,,,,,,,,,,,,,,,,,"Skylab 50th Anniversary",http://libarchstor2.uah.edu/digitalcollections/files/original/21/14254/spc_skyl_000062_000086.pdf,,"Skylab Collection",1,1
14255,http://libarchstor2.uah.edu/digitalcollections/items/show/14255,spc_skyl_000087_000100,"Internal Views of Skylab Experiments.",,"The  images depict the Skylab experiments, as installed in the Skylab habitat. The images also depict the Skylab tape recorder, which would be used to record data from the three manned Skylab missions.","United States. National Aeronautics and Space Administration",,,1970-1979,,,"McDonnell Douglas Corporation^^Skylab Program^^Experimentation^^Airlock modules^^Multiple docking adapters^^Film Vault",Photographs^^Image,,"Skylab Photos^^Box 1, Folder 4^^University of Alabama in Huntsville Archives, Special Collections, and Digital Initiatives, Huntsville, Alabama",,,,en,"This material may be protected under U. S. Copyright Law (Title 17, U.S. Code) which governs the making of photocopies or reproductions of copyrighted materials. You may use the digitized material for private study, scholarship, or research. Though the University of Alabama in Huntsville Archives and Special Collections has physical ownership of the material in its collections, in some cases we may not own the copyright to the material. It is the patron's obligation to determine and satisfy copyright restrictions when publishing or otherwise distributing materials found in our collections.",spc_skyl_spc_skyl_000005_001188,,,,,,,,,,,,,,,,,,,,,,,,,,,,,,,,,,,,,,,,,,,,,,,,,,,,,,,,,,,,,,,,,,,,,,,,,,,,,,"Skylab 50th Anniversary",http://libarchstor2.uah.edu/digitalcollections/files/original/21/14255/spc_skyl_000087_000100.pdf,,"Skylab Collection",1,0
14257,http://libarchstor2.uah.edu/digitalcollections/items/show/14257,spc_skyl_000131_000155,"External Views of Skylab Habitat and Skylab Airlock.",,"The images depict external views of the Skylab habitat, and the Skylab airlock during the assembly process.","United States. National Aeronautics and Space Administration",,,1970-1979,,,"McDonnell Douglas Corporation^^Skylab Program^^Spacecraft electronic equipment^^Airlock modules^^Provisioning^^Experimentation^^Space habitats",Photographs^^Image,,"Skylab Photos^^Box 1, Folder 6^^University of Alabama in Huntsville Archives, Special Collections, and Digital Initiatives, Huntsville, Alabama",,,,en,"This material may be protected under U. S. Copyright Law (Title 17, U.S. Code) which governs the making of photocopies or reproductions of copyrighted materials. You may use the digitized material for private study, scholarship, or research. Though the University of Alabama in Huntsville Archives and Special Collections has physical ownership of the material in its collections, in some cases we may not own the copyright to the material. It is the patron's obligation to determine and satisfy copyright restrictions when publishing or otherwise distributing materials found in our collections.",spc_skyl_spc_skyl_000005_001188,,,,,,,,,,,,,,,,,,,,,,,,,,,,,,,,,,,,,,,,,,,,,,,,,,,,,,,,,,,,,,,,,,,,,,,,,,,,,,"Skylab 50th Anniversary",http://libarchstor2.uah.edu/digitalcollections/files/original/21/14257/spc_skyl_000131_000155.pdf,,"Skylab Collection",1,0
14276,http://libarchstor2.uah.edu/digitalcollections/items/show/14276,spc_skyl_000648_000677,"Skylab Storage Systems, Skylab Safety Systems",,"The images depict the Skylab storage systems for unrefrigerated provisions. The images depict the Skylab storage systems for film. The images depict the Skylab safety systems, including the Skylab fire extinguisher.","United States. National Aeronautics and Space Administration",,,1970-1979,,,"Skylab Program^^Human factors in engineering design^^Life support systems^^Provisioning^^Onboard equipment^^Experimentation^^Space habitats^^Film Vault",Photographs^^Image,,"Skylab Photos^^Box 2, Folder 3^^University of Alabama in Huntsville Archives and Special Collections, Huntsville, Alabama",,,,en,"This material may be protected under U. S. Copyright Law (Title 17, U.S. Code) which governs the making of photocopies or reproductions of copyrighted materials. You may use the digitized material for private study, scholarship, or research. Though the University of Alabama in Huntsville Archives and Special Collections has physical ownership of the material in its collections, in some cases we may not own the copyright to the material. It is the patron's obligation to determine and satisfy copyright restrictions when publishing or otherwise distributing materials found in our collections.",spc_skyl_spc_skyl_000005_001188,,,,,,,,,,,,,,,,,,,,,,,,,,,,,,,,,,,,,,,,,,,,,,,,,,,,,,,,,,,,,,,,,,,,,,,,,,,,,,"Skylab 50th Anniversary",http://libarchstor2.uah.edu/digitalcollections/files/original/21/14276/spc_skyl_000648_000677.pdf,,"Skylab Collection",1,0
14280,http://libarchstor2.uah.edu/digitalcollections/items/show/14280,spc_skyl_000812_000847,"Skylab Life Support Systems, Skylab Storage Systems, and Skylab Experimentation.",,"The images depict Skylab life support systems. The images depict Skylab storage systems related to life support and experimentation. The images depict Skylab experiments.","United States. National Aeronautics and Space Administration",,,1970-1979,,,"Skylab Program^^Provisioning^^Onboard equipment^^Life support systems^^Experimentation^^Space habitats",Photographs^^Image,,"Skylab Photos^^Box 2, Folder 7^^University of Alabama in Huntsville Archives and Special Collections, Huntsville, Alabama",,,,en,"This material may be protected under U. S. Copyright Law (Title 17, U.S. Code) which governs the making of photocopies or reproductions of copyrighted materials. You may use the digitized material for private study, scholarship, or research. Though the University of Alabama in Huntsville Archives and Special Collections has physical ownership of the material in its collections, in some cases we may not own the copyright to the material. It is the patron's obligation to determine and satisfy copyright restrictions when publishing or otherwise distributing materials found in our collections.",spc_skyl_spc_skyl_000005_001188,,,,,,,,,,,,,,,,,,,,,,,,,,,,,,,,,,,,,,,,,,,,,,,,,,,,,,,,,,,,,,,,,,,,,,,,,,,,,,"Skylab 50th Anniversary",http://libarchstor2.uah.edu/digitalcollections/files/original/21/14280/spc_skyl_000812_000847.pdf,,"Skylab Collection",1,0
14285,http://libarchstor2.uah.edu/digitalcollections/items/show/14285,spc_skyl_000974_001002,"Skylab Habitat Urine and Fecal Processing Systems.",,"The images depict the Skylab urine freezing and preservation systems. The images depict the Skylab fecal collection systems. The images depict the Skylab wastewater disposal system.","United States. National Aeronautics and Space Administration",,,1970-1979,,,"McDonnell Douglas Corporation^^Skylab Program^^Human factors in engineering design^^Onboard equipment^^Experimentation^^Space habitats",Photographs^^Image,,"Skylab Photos^^Box 2, Folder 12^^University of Alabama in Huntsville Archives and Special Collections, Huntsville, Alabama",,,,en,"This material may be protected under U. S. Copyright Law (Title 17, U.S. Code) which governs the making of photocopies or reproductions of copyrighted materials. You may use the digitized material for private study, scholarship, or research. Though the University of Alabama in Huntsville Archives and Special Collections has physical ownership of the material in its collections, in some cases we may not own the copyright to the material. It is the patron's obligation to determine and satisfy copyright restrictions when publishing or otherwise distributing materials found in our collections.",spc_skyl_spc_skyl_000005_001188,,,,,,,,,,,,,,,,,,,,,,,,,,,,,,,,,,,,,,,,,,,,,,,,,,,,,,,,,,,,,,,,,,,,,,,,,,,,,,"Skylab 50th Anniversary",http://libarchstor2.uah.edu/digitalcollections/files/original/21/14285/spc_skyl_000974_001002.pdf,,"Skylab Collection",1,0
14286,http://libarchstor2.uah.edu/digitalcollections/items/show/14286,spc_skyl_001003_001032,"Skylab Stowage Systems.",,,"United States. National Aeronautics and Space Administration",,,1970-1979,,,"Skylab Program^^Human factors in engineering design^^Onboard equipment^^Provisioning^^Experimentation^^Space habitats",Photographs^^Image,,"Skylab Photos^^Box 2, Folder 13^^University of Alabama in Huntsville Archives and Special Collections, Huntsville, Alabama",,,,en,"This material may be protected under U. S. Copyright Law (Title 17, U.S. Code) which governs the making of photocopies or reproductions of copyrighted materials. You may use the digitized material for private study, scholarship, or research. Though the University of Alabama in Huntsville Archives and Special Collections has physical ownership of the material in its collections, in some cases we may not own the copyright to the material. It is the patron's obligation to determine and satisfy copyright restrictions when publishing or otherwise distributing materials found in our collections.",spc_skyl_spc_skyl_000005_001188,,,,,,,,,,,,,,,,,,,,,,,,,,,,,,,,,,,,,,,,,,,,,,,,,,,,,,,,,,,,,,,,,,,,,,,,,,,,,,"Skylab 50th Anniversary",http://libarchstor2.uah.edu/digitalcollections/files/original/21/14286/spc_skyl_001003_001032.pdf,,"Skylab Collection",1,0
14290,http://libarchstor2.uah.edu/digitalcollections/items/show/14290,spc_skyl_001116_001169,"Skylab Testing and Equipment.",,"The images depict the Skylab neutral buoyancy tests. The images depict the Skylab equipment tests.","United States. National Aeronautics and Space Administration",,,1970-1979,,,"Conrad, Charles, Jr.^^Gibson, Edward G.^^Kerwin, Joseph P.^^Musgrave, Story^^Schweickart, Russell L.^^McDonnell Douglas Corporation^^Skylab Program^^Spacecraft electronic equipment^^Onboard equipment^^Experimentation^^Neutral buoyancy simulation^^Film Vault",Photographs^^Image,,"Skylab Photos^^Box 3, Folder 3^^University of Alabama in Huntsville Archives and Special Collections, Huntsville, Alabama",,,,en,"This material may be protected under U. S. Copyright Law (Title 17, U.S. Code) which governs the making of photocopies or reproductions of copyrighted materials. You may use the digitized material for private study, scholarship, or research. Though the University of Alabama in Huntsville Archives and Special Collections has physical ownership of the material in its collections, in some cases we may not own the copyright to the material. It is the patron's obligation to determine and satisfy copyright restrictions when publishing or otherwise distributing materials found in our collections.",spc_skyl_spc_skyl_000005_001188,,,,,,,,,,,,,,,,,,,,,,,,,,,,,,,,,,,,,,,,,,,,,,,,,,,,,,,,,,,,,,,,,,,,,,,,,,,,,,"Skylab 50th Anniversary",http://libarchstor2.uah.edu/digitalcollections/files/original/21/14290/spc_skyl_001116_001169.pdf,,"Skylab Collection",1,0
