﻿"Item Id","Item URI","Dublin Core:Identifier","Dublin Core:Title","Dublin Core:Alternative Title","Dublin Core:Description","Dublin Core:Creator","Dublin Core:Publisher","Dublin Core:Date","Dublin Core:Temporal Coverage","Dublin Core:Coverage","Dublin Core:Spatial Coverage","Dublin Core:Subject","Dublin Core:Type","Dublin Core:Format","Dublin Core:Source","Dublin Core:Is Part Of","Dublin Core:Has Format","Dublin Core:Provenance","Dublin Core:Language","Dublin Core:Rights","Dublin Core:Relation","Dublin Core:Contributor","Dublin Core:Abstract","Dublin Core:Table Of Contents","Dublin Core:Date Available","Dublin Core:Date Created","Dublin Core:Date Accepted","Dublin Core:Date Copyrighted","Dublin Core:Date Submitted","Dublin Core:Date Issued","Dublin Core:Date Modified","Dublin Core:Date Valid","Dublin Core:Access Rights","Dublin Core:License","Dublin Core:Conforms To","Dublin Core:Has Part","Dublin Core:Has Version","Dublin Core:Is Format Of","Dublin Core:Is Referenced By","Dublin Core:Is Replaced By","Dublin Core:Is Required By","Dublin Core:Is Version Of","Dublin Core:References","Dublin Core:Replaces","Dublin Core:Requires","Dublin Core:Extent","Dublin Core:Medium","Dublin Core:Bibliographic Citation","Dublin Core:Accrual Method","Dublin Core:Accrual Periodicity","Dublin Core:Accrual Policy","Dublin Core:Audience","Dublin Core:Audience Education Level","Dublin Core:Mediator","Dublin Core:Instructional Method","Dublin Core:Rights Holder","Item Type Metadata:Text","Item Type Metadata:Interviewer","Item Type Metadata:Interviewee","Item Type Metadata:Location","Item Type Metadata:Transcription","Item Type Metadata:Local URL","Item Type Metadata:Original Format","Item Type Metadata:Physical Dimensions","Item Type Metadata:Duration","Item Type Metadata:Compression","Item Type Metadata:Producer","Item Type Metadata:Director","Item Type Metadata:Bit Rate/Frequency","Item Type Metadata:Time Summary","Item Type Metadata:Email Body","Item Type Metadata:Subject Line","Item Type Metadata:From","Item Type Metadata:To","Item Type Metadata:CC","Item Type Metadata:BCC","Item Type Metadata:Number of Attachments","Item Type Metadata:Standards","Item Type Metadata:Objectives","Item Type Metadata:Materials","Item Type Metadata:Lesson Plan Text","Item Type Metadata:URL","Item Type Metadata:Event Type","Item Type Metadata:Participants","Item Type Metadata:Birth Date","Item Type Metadata:Birthplace","Item Type Metadata:Death Date","Item Type Metadata:Occupation","Item Type Metadata:Biographical Text","Item Type Metadata:Bibliography","Item Type Metadata:Player","Item Type Metadata:Imported Thumbnail","Item Type Metadata:OHMS Object","Item Type Metadata:OHMS Object Text","Item Type Metadata:Interview Keyword","Item Type Metadata:Sort Priority","PDF Text:Text",Scripto:Transcription,tags,file,itemType,collection,public,featured
8234,http://libarchstor2.uah.edu/digitalcollections/items/show/8234,r04a04-05,"Mastin, Mary Jane, 1902",,,"Clay, Virginia C.",,1902,1900-1909,,,"Easter^^Mastin, Mary Jane^^Religion^^Salutations","Easter cards",,"Frances Cabaniss Roberts Collection^^Series 4, Subseries A, Box 4, Folder 5^^University of Alabama in Huntsville Archives, Special Collections, and Digital Initiatives, Huntsville, Alabama",,,,en,"This material may be protected under U. S. Copyright Law (Title 17, U.S. Code) which governs the making of photocopies or reproductions of copyrighted materials. You may use the digitized material for private study, scholarship, or research. Though the University of Alabama in Huntsville Archives and Special Collections has physical ownership of the material in its collections, in some cases we may not own the copyright to the material. It is the patron's obligation to determine and satisfy copyright restrictions when publishing or otherwise distributing materials found in our collections.",r04a-210924,,,,,,,,,,,,,,,,,,,,,,,,,,,,,,,,,,,,,,,,,,,,,,,,,,,,,,,,,,,,,,,,,,,,,,,,,,,,,,,http://dkdayton.net/roberts/images/r04a/pdfs/r04a04-05.pdf,"Still Image","Series 04, Subseries A: Huntsville History",1,0
8109,http://libarchstor2.uah.edu/digitalcollections/items/show/8109,r04a10-11,"Church of Nativity (Episcopal) Miscellaneous Notes for Book",,,,,,1970-1979^^1980-1989,,,"Alabama–History–Huntsville, Madison County^^Church of the Nativity, Episcopal (Huntsville, Ala.)^^Easter^^History–Research^^Personal correspondence",Correspondence^^Notes^^Pamphlets,,"Frances Cabaniss Roberts Collection^^Series 4, Subseries A, Box 10, Folder 11^^University of Alabama in Huntsville Archives, Special Collections, and Digital Initiatives, Huntsville, Alabama",,,,en,"This material may be protected under U. S. Copyright Law (Title 17, U.S. Code) which governs the making of photocopies or reproductions of copyrighted materials. You may use the digitized material for private study, scholarship, or research. Though the University of Alabama in Huntsville Archives and Special Collections has physical ownership of the material in its collections, in some cases we may not own the copyright to the material. It is the patron's obligation to determine and satisfy copyright restrictions when publishing or otherwise distributing materials found in our collections.",r04a-210924,,,,,,,,,,,,,,,,,,,,,,,,,,,,,,,,,,,,,,,,,,,,,,,,,,,,,,,,,,,,,,,,,,,,,,,,,,,,,,,http://dkdayton.net/roberts/images/r04a/pdfs/r04a10-11.pdf,"Still Image","Series 04, Subseries A: Huntsville History",1,0
1622,http://libarchstor2.uah.edu/digitalcollections/items/show/1622,spc_dann_000120^^MC_43_004,"""Easter 1956 [ILLEGIBLE].""",,"Klaus, Konrad, and Ingeborg Dannenberg attend Easter Services and return to 5901 Jumilla Ave. in Los Angeles, California for Easter celebrations, Spring 1956.","Dannenberg, Konrad",,1956,1950-1959,,,"Dannenberg, Konrad^^Easter^^German Americans^^Los Angeles (Calif.)","Moving Image^^Home movies","8 mm (photographic film size)","Konrad Dannenberg Collection^^University of Alabama in Huntsville Archives, Special Collections, and Digital Initiatives, Huntsville, Alabama",,,"Donated by Klaus Dannenberg. Digitized for the 2019-2020 CLIR Recordings at Risk grant.",en,"This material may be protected under U. S. Copyright Law (Title 17, U.S. Code) which governs the making of photocopies or reproductions of copyrighted materials. You may use the digitized material for private study, scholarship, or research. Though the University of Alabama in Huntsville Archives and Special Collections has physical ownership of the material in its collections, in some cases we may not own the copyright to the material. It is the patron's obligation to determine and satisfy copyright restrictions when publishing or otherwise distributing materials found in our collections.",clir_grant_film_metadata,,,,,,,,,,,,,,,,,,,,,,,,,,,,,,,,,,,,,,,,,,,,0:04:20,,,,,,,,,,,,,,,,,,,,,,,,,,,,,,,,,,,http://libarchstor2.uah.edu/digitalcollections/files/original/9/1622/spc_dann_000120.mp4,,"Konrad Dannenberg Collection",1,0
1621,http://libarchstor2.uah.edu/digitalcollections/items/show/1621,spc_dann_000119^^MC_43_003,"""Easter 1956, egg hunting.""",,"Christmas cards on display at Dannenberg residence 5901 Jumilla Ave, winter 1955. Setup of Easter baskets and candies. Spring 1956.","Dannenberg, Konrad",,1955-1956,1950-1959,,,"Dannenberg, Konrad^^Christmas^^Easter^^German Americans^^Los Angeles (Calif.)","Moving Image^^Home movies","8 mm (photographic film size)","Konrad Dannenberg Collection^^University of Alabama in Huntsville Archives, Special Collections, and Digital Initiatives, Huntsville, Alabama",,,"Donated by Klaus Dannenberg. Digitized for the 2019-2020 CLIR Recordings at Risk grant.",en,"This material may be protected under U. S. Copyright Law (Title 17, U.S. Code) which governs the making of photocopies or reproductions of copyrighted materials. You may use the digitized material for private study, scholarship, or research. Though the University of Alabama in Huntsville Archives and Special Collections has physical ownership of the material in its collections, in some cases we may not own the copyright to the material. It is the patron's obligation to determine and satisfy copyright restrictions when publishing or otherwise distributing materials found in our collections.",clir_grant_film_metadata,,,,,,,,,,,,,,,,,,,,,,,,,,,,,,,,,,,,,,,,,,,,0:04:14,,,,,,,,,,,,,,,,,,,,,,,,,,,,,,,,,,,http://libarchstor2.uah.edu/digitalcollections/files/original/9/1621/spc_dann_000119.mp4,,"Konrad Dannenberg Collection",1,0
1620,http://libarchstor2.uah.edu/digitalcollections/items/show/1620,spc_dann_000118^^MC_43_002,"""X-mas 55 , Easter 1956 [ILLEGIBLE].""",,"Christmas neighborhood decorations in Woodland Hills, Los Angeles, California, winter 1955. Klaus, Konrad, and Ingeborg Dannenberg hunt for Easter eggs in California in spring of 1956 at 5901 Jumilla Ave.","Dannenberg, Konrad",,1955-1956,1950-1959,,,"Dannenberg, Konrad^^Christmas^^Easter^^German Americans^^Los Angeles (Calif.)","Moving Image^^Home movies","8 mm (photographic film size)","Konrad Dannenberg Collection^^University of Alabama in Huntsville Archives, Special Collections, and Digital Initiatives, Huntsville, Alabama",,,"Donated by Klaus Dannenberg. Digitized for the 2019-2020 CLIR Recordings at Risk grant.",en,"This material may be protected under U. S. Copyright Law (Title 17, U.S. Code) which governs the making of photocopies or reproductions of copyrighted materials. You may use the digitized material for private study, scholarship, or research. Though the University of Alabama in Huntsville Archives and Special Collections has physical ownership of the material in its collections, in some cases we may not own the copyright to the material. It is the patron's obligation to determine and satisfy copyright restrictions when publishing or otherwise distributing materials found in our collections.",clir_grant_film_metadata,,,,,,,,,,,,,,,,,,,,,,,,,,,,,,,,,,,,,,,,,,,,0:04:25,,,,,,,,,,,,,,,,,,,,,,,,,,,,,,,,,,,http://libarchstor2.uah.edu/digitalcollections/files/original/9/1620/spc_dann_000118.mp4,,"Konrad Dannenberg Collection",1,0
1619,http://libarchstor2.uah.edu/digitalcollections/items/show/1619,spc_dann_000117^^MC_43_001,"""Easter 56 - egg.""",,"Klaus, Konrad, and Ingeborg Dannenberg hunt for Easter eggs in Los Angeles, California in spring of 1956 at 5901 Jumilla Ave.","Dannenberg, Konrad",,1956,1950-1959,,,"Dannenberg, Konrad^^Easter^^German Americans^^Los Angeles (Calif.)","Moving Image^^Home movies","8 mm (photographic film size)","Konrad Dannenberg Collection^^University of Alabama in Huntsville Archives, Special Collections, and Digital Initiatives, Huntsville, Alabama",,,"Donated by Klaus Dannenberg. Digitized for the 2019-2020 CLIR Recordings at Risk grant.",en,"This material may be protected under U. S. Copyright Law (Title 17, U.S. Code) which governs the making of photocopies or reproductions of copyrighted materials. You may use the digitized material for private study, scholarship, or research. Though the University of Alabama in Huntsville Archives and Special Collections has physical ownership of the material in its collections, in some cases we may not own the copyright to the material. It is the patron's obligation to determine and satisfy copyright restrictions when publishing or otherwise distributing materials found in our collections.",clir_grant_film_metadata,,,,,,,,,,,,,,,,,,,,,,,,,,,,,,,,,,,,,,,,,,,,0:04:20,,,,,,,,,,,,,,,,,,,,,,,,,,,,,,,,,,,http://libarchstor2.uah.edu/digitalcollections/files/original/9/1619/spc_dann_000117.mp4,,"Konrad Dannenberg Collection",1,0
1617,http://libarchstor2.uah.edu/digitalcollections/items/show/1617,spc_dann_000318^^MC_43_200,"""Klaus and Jud Lynn Easter egg hunting. Dogwoods in Huntsville.""",,"Klaus and Jud Lynn hunt for Easter eggs and attend church service at St. Mark's Evangelical Lutheran Church. Spritime scenes around Huntsville.","Dannenberg, Konrad",,1954,1960-1969,,,"Dannenberg, Konrad^^German Americans^^Easter^^Dogwoods^^Huntsville (Ala.)","Moving Image^^Home movies","8 mm (photographic film size)","Konrad Dannenberg Collection^^University of Alabama in Huntsville Archives, Special Collections, and Digital Initiatives, Huntsville, Alabama",,,"Donated by Klaus Dannenberg. Digitized for the 2019-2020 CLIR Recordings at Risk grant.",en,"This material may be protected under U. S. Copyright Law (Title 17, U.S. Code) which governs the making of photocopies or reproductions of copyrighted materials. You may use the digitized material for private study, scholarship, or research. Though the University of Alabama in Huntsville Archives and Special Collections has physical ownership of the material in its collections, in some cases we may not own the copyright to the material. It is the patron's obligation to determine and satisfy copyright restrictions when publishing or otherwise distributing materials found in our collections.",clir_grant_film_metadata,,,,,,,,,,,,,,,,,,,,,,,,,,,,,,,,,,,,,,,,,,,,,,,,,,,,,,,,,,,,,,,,,,,,,,,,,,,,,,,http://libarchstor2.uah.edu/digitalcollections/files/original/9/1617/spc_dann_000318.mp4,,"Konrad Dannenberg Collection",1,0
1327,http://libarchstor2.uah.edu/digitalcollections/items/show/1327,spc_dann_000291^^MC_43_175,"""Easter '78 Egg hunt.""",,"Klaus, Kerry, Betty, and Christie visit Ingeborg and Konrad for Easter on Monte Sano, Huntsville, Alabama. They are shown arriving and hunting for Easter eggs shortly afterwards. Spring 1978","Dannenberg, Konrad",,1978-03,1970-1979,,,"Dannenberg, Konrad^^German Americans^^Easter^^Huntsville (Ala.)^^Madison County (Ala.)","Home movies^^Moving Image","8 mm (photographic film size)","Konrad Dannenberg Collection^^University of Alabama in Huntsville Archives, Special Collections, and Digital Initiatives, Huntsville, Alabama",,,"Donated by Klaus Dannenberg. Digitized for the 2019-2020 CLIR Recordings at Risk grant.",de^^en,"This material may be protected under U. S. Copyright Law (Title 17, U.S. Code) which governs the making of photocopies or reproductions of copyrighted materials. You may use the digitized material for private study, scholarship, or research. Though the University of Alabama in Huntsville Archives and Special Collections has physical ownership of the material in its collections, in some cases we may not own the copyright to the material. It is the patron's obligation to determine and satisfy copyright restrictions when publishing or otherwise distributing materials found in our collections.",clir_grant_film_metadata_02,,,,,,,,,,,,,,,,,,,,,,,,,,,,,,,,,,,,,,,,,,,,0:03:21,,,,,,,,,,,,,,,,,,,,,,,,,,,,,,,,,,,http://libarchstor2.uah.edu/digitalcollections/files/original/9/1327/spc_dann_000291.mp4,,"Konrad Dannenberg Collection",1,0
1322,http://libarchstor2.uah.edu/digitalcollections/items/show/1322,spc_dann_000286^^MC_43_170,"""Easter egg hunt, All, #3, '77.""",,"The Doanes (Ulla, George, Johnny) join the Dannenbergs (Konrad, Ingeborg, Klaus, Betty, Kerry, and Christie) at Konrad ant Ingeborg's house in Monte Sano, Huntsville, Alabama. After briefly showing the Easter decorations inside the house, the film shows Kerry, Christie, and Johnny looking for Easter eggs in the front yard. Spring 1977.","Dannenberg, Konrad",,1977-04,1970-1979,,,"Dannenberg, Konrad^^German Americans^^Easter^^Huntsville (Ala.)^^Madison County (Ala.)","Home movies^^Moving Image","8 mm (photographic film size)","Konrad Dannenberg Collection^^University of Alabama in Huntsville Archives, Special Collections, and Digital Initiatives, Huntsville, Alabama",,,"Donated by Klaus Dannenberg. Digitized for the 2019-2020 CLIR Recordings at Risk grant.",de^^en,"This material may be protected under U. S. Copyright Law (Title 17, U.S. Code) which governs the making of photocopies or reproductions of copyrighted materials. You may use the digitized material for private study, scholarship, or research. Though the University of Alabama in Huntsville Archives and Special Collections has physical ownership of the material in its collections, in some cases we may not own the copyright to the material. It is the patron's obligation to determine and satisfy copyright restrictions when publishing or otherwise distributing materials found in our collections.",clir_grant_film_metadata_02,,,,,,,,,,,,,,,,,,,,,,,,,,,,,,,,,,,,,,,,,,,,0:03:26,,,,,,,,,,,,,,,,,,,,,,,,,,,,,,,,,,,http://libarchstor2.uah.edu/digitalcollections/files/original/9/1322/spc_dann_000286.mp4,,"Konrad Dannenberg Collection",1,0
1321,http://libarchstor2.uah.edu/digitalcollections/items/show/1321,spc_dann_000285^^MC_43_169,"""Easter egg hunt, All, #2, '77.""",,"The Doanes (Ulla, George, Johnny) join the Dannenbergs (Konrad, Ingeborg, Klaus, Betty, Kerry, and Christie) at Konrad and Ingeborg's house in Monte Sano, Huntsville, Alabama. Once they arrive, the kids of the group are shown hunting for Easter eggs in the front yard while the adults help and talk on the doorstep. Spring 1977.","Dannenberg, Konrad",,1977-04,1970-1979,,,"Dannenberg, Konrad^^German Americans^^Easter^^Huntsville (Ala.)^^Madison County (Ala.)","Home movies^^Moving Image","8 mm (photographic film size)","Konrad Dannenberg Collection^^University of Alabama in Huntsville Archives, Special Collections, and Digital Initiatives, Huntsville, Alabama",,,"Donated by Klaus Dannenberg. Digitized for the 2019-2020 CLIR Recordings at Risk grant.",de^^en,"This material may be protected under U. S. Copyright Law (Title 17, U.S. Code) which governs the making of photocopies or reproductions of copyrighted materials. You may use the digitized material for private study, scholarship, or research. Though the University of Alabama in Huntsville Archives and Special Collections has physical ownership of the material in its collections, in some cases we may not own the copyright to the material. It is the patron's obligation to determine and satisfy copyright restrictions when publishing or otherwise distributing materials found in our collections.",clir_grant_film_metadata_02,,,,,,,,,,,,,,,,,,,,,,,,,,,,,,,,,,,,,,,,,,,,0:03:25,,,,,,,,,,,,,,,,,,,,,,,,,,,,,,,,,,,http://libarchstor2.uah.edu/digitalcollections/files/original/9/1321/spc_dann_000285.mp4,,"Konrad Dannenberg Collection",1,0
1320,http://libarchstor2.uah.edu/digitalcollections/items/show/1320,spc_dann_000284^^MC_43_168,"""Easter '77 w/ K, B, Kerry &amp; Christie #1.""",,"Film shows Klaus, Betty, Kerry, and Christie arriving at Konrad and Ingeborg's house for Easter in Monte Sano, Huntsville, Alabama. After arriving, all parties are seen win the front yard, possibly for an Easter egg hunt. Spring 1977.","Dannenberg, Konrad",,1977-04,1970-1979,,,"Dannenberg, Konrad^^German Americans^^Easter^^Huntsville (Ala.)^^Madison County (Ala.)","Home movies^^Moving Image","8 mm (photographic film size)","Konrad Dannenberg Collection^^University of Alabama in Huntsville Archives, Special Collections, and Digital Initiatives, Huntsville, Alabama",,,"Donated by Klaus Dannenberg. Digitized for the 2019-2020 CLIR Recordings at Risk grant.",de^^en,"This material may be protected under U. S. Copyright Law (Title 17, U.S. Code) which governs the making of photocopies or reproductions of copyrighted materials. You may use the digitized material for private study, scholarship, or research. Though the University of Alabama in Huntsville Archives and Special Collections has physical ownership of the material in its collections, in some cases we may not own the copyright to the material. It is the patron's obligation to determine and satisfy copyright restrictions when publishing or otherwise distributing materials found in our collections.",clir_grant_film_metadata_02,,,,,,,,,,,,,,,,,,,,,,,,,,,,,,,,,,,,,,,,,,,,0:03:23,,,,,,,,,,,,,,,,,,,,,,,,,,,,,,,,,,,http://libarchstor2.uah.edu/digitalcollections/files/original/9/1320/spc_dann_000284.mp4,,"Konrad Dannenberg Collection",1,0
1302,http://libarchstor2.uah.edu/digitalcollections/items/show/1302,spc_dann_000266^^MC_43_150,"Dallas 1972, Easter-Egg-Hunt.""",,"Kerry, Betty, and Klaus Dannenberg attend an Easter egg hunt around the local pool of the Brookgreen Park apartment complex, where they live in Dallas, Texas. Many other families are shown also bringing their kids to the hunt, and Kerry Dannenberg is shown finding some of the eggs. Spring 1972.","Dannenberg, Konrad",,1972-04,1970-1979,,,"Dannenberg, Konrad^^German Americans^^Easter^^Dallas (Tex.)","Home movies^^Moving Image","8 mm (photographic film size)","Konrad Dannenberg Collection^^University of Alabama in Huntsville Archives, Special Collections, and Digital Initiatives, Huntsville, Alabama",,,"Donated by Klaus Dannenberg. Digitized for the 2019-2020 CLIR Recordings at Risk grant.",de^^en,"This material may be protected under U. S. Copyright Law (Title 17, U.S. Code) which governs the making of photocopies or reproductions of copyrighted materials. You may use the digitized material for private study, scholarship, or research. Though the University of Alabama in Huntsville Archives and Special Collections has physical ownership of the material in its collections, in some cases we may not own the copyright to the material. It is the patron's obligation to determine and satisfy copyright restrictions when publishing or otherwise distributing materials found in our collections.",clir_grant_film_metadata_02,,,,,,,,,,,,,,,,,,,,,,,,,,,,,,,,,,,,,,,,,,,,0:03:28,,,,,,,,,,,,,,,,,,,,,,,,,,,,,,,,,,,http://libarchstor2.uah.edu/digitalcollections/files/original/9/1302/spc_dann_000266.mp4,,"Konrad Dannenberg Collection",1,0
1301,http://libarchstor2.uah.edu/digitalcollections/items/show/1301,spc_dann_000265^^MC_43_149,"""Easter 1972, Dallas.""",,"Film shows an Easter egg hunt at Klaus and Betty Dannenberg's house in Dallas, Texas. Klaus and Betty are shown hiding the eggs and Kerry Dannenberg and a friend of his are shown hunting the eggs. Spring 1972.","Dannenberg, Konrad",,1972-04,1970-1979,,,"Dannenberg, Konrad^^German Americans^^Easter^^Dallas (Tex.)","Home movies^^Moving Image","8 mm (photographic film size)","Konrad Dannenberg Collection^^University of Alabama in Huntsville Archives, Special Collections, and Digital Initiatives, Huntsville, Alabama",,,"Donated by Klaus Dannenberg. Digitized for the 2019-2020 CLIR Recordings at Risk grant.",de^^en,"This material may be protected under U. S. Copyright Law (Title 17, U.S. Code) which governs the making of photocopies or reproductions of copyrighted materials. You may use the digitized material for private study, scholarship, or research. Though the University of Alabama in Huntsville Archives and Special Collections has physical ownership of the material in its collections, in some cases we may not own the copyright to the material. It is the patron's obligation to determine and satisfy copyright restrictions when publishing or otherwise distributing materials found in our collections.",clir_grant_film_metadata_02,,,,,,,,,,,,,,,,,,,,,,,,,,,,,,,,,,,,,,,,,,,,0:03:23,,,,,,,,,,,,,,,,,,,,,,,,,,,,,,,,,,,http://libarchstor2.uah.edu/digitalcollections/files/original/9/1301/spc_dann_000265.mp4,,"Konrad Dannenberg Collection",1,0