﻿"Item Id","Item URI","Dublin Core:Identifier","Dublin Core:Title","Dublin Core:Alternative Title","Dublin Core:Description","Dublin Core:Creator","Dublin Core:Publisher","Dublin Core:Date","Dublin Core:Temporal Coverage","Dublin Core:Coverage","Dublin Core:Spatial Coverage","Dublin Core:Subject","Dublin Core:Type","Dublin Core:Format","Dublin Core:Source","Dublin Core:Is Part Of","Dublin Core:Has Format","Dublin Core:Provenance","Dublin Core:Language","Dublin Core:Rights","Dublin Core:Relation","Dublin Core:Contributor","Dublin Core:Abstract","Dublin Core:Table Of Contents","Dublin Core:Date Available","Dublin Core:Date Created","Dublin Core:Date Accepted","Dublin Core:Date Copyrighted","Dublin Core:Date Submitted","Dublin Core:Date Issued","Dublin Core:Date Modified","Dublin Core:Date Valid","Dublin Core:Access Rights","Dublin Core:License","Dublin Core:Conforms To","Dublin Core:Has Part","Dublin Core:Has Version","Dublin Core:Is Format Of","Dublin Core:Is Referenced By","Dublin Core:Is Replaced By","Dublin Core:Is Required By","Dublin Core:Is Version Of","Dublin Core:References","Dublin Core:Replaces","Dublin Core:Requires","Dublin Core:Extent","Dublin Core:Medium","Dublin Core:Bibliographic Citation","Dublin Core:Accrual Method","Dublin Core:Accrual Periodicity","Dublin Core:Accrual Policy","Dublin Core:Audience","Dublin Core:Audience Education Level","Dublin Core:Mediator","Dublin Core:Instructional Method","Dublin Core:Rights Holder","Item Type Metadata:Text","Item Type Metadata:Interviewer","Item Type Metadata:Interviewee","Item Type Metadata:Location","Item Type Metadata:Transcription","Item Type Metadata:Local URL","Item Type Metadata:Original Format","Item Type Metadata:Physical Dimensions","Item Type Metadata:Duration","Item Type Metadata:Compression","Item Type Metadata:Producer","Item Type Metadata:Director","Item Type Metadata:Bit Rate/Frequency","Item Type Metadata:Time Summary","Item Type Metadata:Email Body","Item Type Metadata:Subject Line","Item Type Metadata:From","Item Type Metadata:To","Item Type Metadata:CC","Item Type Metadata:BCC","Item Type Metadata:Number of Attachments","Item Type Metadata:Standards","Item Type Metadata:Objectives","Item Type Metadata:Materials","Item Type Metadata:Lesson Plan Text","Item Type Metadata:URL","Item Type Metadata:Event Type","Item Type Metadata:Participants","Item Type Metadata:Birth Date","Item Type Metadata:Birthplace","Item Type Metadata:Death Date","Item Type Metadata:Occupation","Item Type Metadata:Biographical Text","Item Type Metadata:Bibliography","Item Type Metadata:Player","Item Type Metadata:Imported Thumbnail","Item Type Metadata:OHMS Object","Item Type Metadata:OHMS Object Text","Item Type Metadata:Interview Keyword","Item Type Metadata:Sort Priority","PDF Text:Text",Scripto:Transcription,tags,file,itemType,collection,public,featured
7543,http://libarchstor2.uah.edu/digitalcollections/items/show/7543,r01c01-31,"Gibson, Mrs. K. to Cabaniss, Charles Eugene, 1875",,,"Gibson, K. Mrs.",,,1870-1879,,,"Photography--Alabama^^Framing^^Blacksmithing^^Athens (Ala.)^^Atlanta (Ga.)",Correspondence,,"Series 1, Subseries C, Box 1, Folder 31",,,,en,"This material may be protected under U. S. Copyright Law (Title 17, U.S. Code) which governs the making of photocopies or reproductions of copyrighted materials. You may use the digitized material for private study, scholarship, or research. Though the University of Alabama in Huntsville Archives and Special Collections has physical ownership of the material in its collections, in some cases we may not own the copyright to the material. It is the patron's obligation to determine and satisfy copyright restrictions when publishing or otherwise distributing materials found in our collections.",r01c-210910,,,,,,,,,,,,,,,,,,,,,,,,,,,,,,,,,,,,,,,,,,,,,,,,,,,,,,,,,,,,,,,,,,,,,,,,,,,,,,,http://dkdayton.net/roberts/images/r01c/pdfs/r01c01-31.pdf,"Still Image","Series 01, Subseries C: Cabaniss Personal Correspondence",1,0
6568,http://libarchstor2.uah.edu/digitalcollections/items/show/6568,loc_jonh_001667_001670,"Architecture notebook 9: Log House at N. Beaty St. and Wood St. in Athens, Ala.",,"Log House in Athens, Alabama. Greek Revival and Victorian style. Located on southwest corner of North Beaty St. and Wood St. ^^Addresses and locations of the structures pictured may no longer be accurate, as street names and house numbers change over time. The addresses given reflect the information provided by Harvie Jones at the time he documented these structures.","Jones, Harvie P.",,,1980-1989^^1990-1999,,,"Architecture, Domestic^^Architecture--United States^^Log houses^^Athens (Ala.)^^Limestone County (Ala.)^^Dwellings","Photograph albums^^Photographs^^Still Image^^Text",,"Harvie P. Jones Collection^^Box 31, Folder 30^^University of Alabama in Huntsville Archives, Special Collections, and Digital Initiatives, Huntsville, Alabama",,,,en,"This material may be protected under U. S. Copyright Law (Title 17, U.S. Code) which governs the making of photocopies or reproductions of copyrighted materials. You may use the digitized material for private study, scholarship, or research. Though the University of Alabama in Huntsville Archives and Special Collections has physical ownership of the material in its collections, in some cases we may not own the copyright to the material. It is the patron's obligation to determine and satisfy copyright restrictions when publishing or otherwise distributing materials found in our collections.",loc_jonh_2021_01C,,,,,,,,,,,,,,,,,,,,,,,,,,,,,,,,,,,,,,,,,,,,,,,,,,,,,,,,,,,,,,,,,,,,,,,,,,,,,,,http://libarchstor2.uah.edu/digitalcollections/files/original/162/6568/loc_jonh_001667_001670R.pdf,,"Limestone County",1,0
6553,http://libarchstor2.uah.edu/digitalcollections/items/show/6553,loc_jonh_001432_001472,"Architecture notebook 8: Donnell House, in Athens, Ala.",,"Donnell House, built 1851. Designed by Hiram Higgins and built by Alexander Hamilton. Originally home to Robert Donnell, a founder of the Cumberland Presbytarian Church and supposedly the preacher of the first sermon in Madison County. Located in Athens, Alabama.^^Addresses and locations of the structures pictured may no longer be accurate, as street names and house numbers change over time. The addresses given reflect the information provided by Harvie Jones at the time he documented these structures.","Jones, Harvie P.",,,1980-1989^^1990-1999,,,"Architecture, Domestic^^Architecture--United States^^Athens (Ala.)^^Limestone County (Ala.)^^Dwellings","Photograph albums^^Photographs^^Still Image^^Text",,"Harvie P. Jones Collection^^Box 31, Folder 14^^University of Alabama in Huntsville Archives, Special Collections, and Digital Initiatives, Huntsville, Alabama",,,,en,"This material may be protected under U. S. Copyright Law (Title 17, U.S. Code) which governs the making of photocopies or reproductions of copyrighted materials. You may use the digitized material for private study, scholarship, or research. Though the University of Alabama in Huntsville Archives and Special Collections has physical ownership of the material in its collections, in some cases we may not own the copyright to the material. It is the patron's obligation to determine and satisfy copyright restrictions when publishing or otherwise distributing materials found in our collections.",loc_jonh_2021_01C,,,,,,,,,,,,,,,,,,,,,,,,,,,,,,,,,,,,,,,,,,,,,,,,,,,,,,,,,,,,,,,,,,,,,,,,,,,,,,,http://libarchstor2.uah.edu/digitalcollections/files/original/162/6553/loc_jonh_001432_001472R.pdf,,"Limestone County",1,0
11279,http://libarchstor2.uah.edu/digitalcollections/items/show/11279,loc_jonh_014149_014327,"Architecture notebook 78: Historic District in Athens, Ala.",,"Articles and notes on a possible historic district in Athens. Included are a list of historic residential structures that might anchor the district: Sloss-Pettus-Cook House, Annette Apartments, Nazaretian House, and Garino House. Located in Athens, Ala.","Jones, Harvie P.",,,1980-1989^^1990-1999,,,"Architecture, Domestic^^Architecture--United States^^Historic district^^Athens (Ala.)^^Limestone County (Ala.)","Photograph albums^^Photographs^^Still Image^^Text",,"University of Alabama in Huntsville Archives, Special Collections, and Digital Initiatives, Huntsville, Alabama",,,,en,"This material may be protected under U. S. Copyright Law (Title 17, U.S. Code) which governs the making of photocopies or reproductions of copyrighted materials. You may use the digitized material for private study, scholarship, or research. Though the University of Alabama in Huntsville Archives and Special Collections has physical ownership of the material in its collections, in some cases we may not own the copyright to the material. It is the patron's obligation to determine and satisfy copyright restrictions when publishing or otherwise distributing materials found in our collections.",loc_jonh_2022,,,,,,,,,,,,,,,,,,,,,,,,,,,,,,,,,,,,,,,,,,,,,,,,,,,,,,,,,,,,,,,,,,,,,,,,,,,,,,,,,"Limestone County",1,0
11278,http://libarchstor2.uah.edu/digitalcollections/items/show/11278,loc_jonh_013734_013778,"Architecture notebook 72: 98 Brookwood Dr in Athens, Ala.",,"Several photos of a home that failed to fill out the National Register of Historic Places paperwork in Athens, Ala.","Jones, Harvie P.",,,1980-1989^^1990-1999,,,"Architecture, Domestic^^Architecture--United States^^Historic houses^^Athens (Ala.)^^Limestone County (Ala.)","Photograph albums^^Photographs^^Still Image^^Text",,"University of Alabama in Huntsville Archives, Special Collections, and Digital Initiatives, Huntsville, Alabama",,,,en,"This material may be protected under U. S. Copyright Law (Title 17, U.S. Code) which governs the making of photocopies or reproductions of copyrighted materials. You may use the digitized material for private study, scholarship, or research. Though the University of Alabama in Huntsville Archives and Special Collections has physical ownership of the material in its collections, in some cases we may not own the copyright to the material. It is the patron's obligation to determine and satisfy copyright restrictions when publishing or otherwise distributing materials found in our collections.",loc_jonh_2022,,,,,,,,,,,,,,,,,,,,,,,,,,,,,,,,,,,,,,,,,,,,,,,,,,,,,,,,,,,,,,,,,,,,,,,,,,,,,,,http://libarchstor2.uah.edu/digitalcollections/files/original/162/11278/loc_jonh_013734_013778.pdf,,"Limestone County",1,0
11277,http://libarchstor2.uah.edu/digitalcollections/items/show/11277,loc_jonh_013591_013603,"Architecture notebook 69: Beaty-Mason House in Athens, Ala.",,"Built in the early 1820s with later add-ons. The portico is Greek Revival style. The kitchen and fireplace crane served as the inspiration for the ""Boardman kitchen"" at Alabama Constitution Village. Located at 211 S. Beaty St. in Athens, Ala.","Jones, Harvie P.",,,1980-1989^^1990-1999,,,"Architecture, Domestic^^Architecture--United States^^Historic houses^^Athens (Ala.)^^Limestone County (Ala.)","Photograph albums^^Photographs^^Still Image^^Text",,"University of Alabama in Huntsville Archives, Special Collections, and Digital Initiatives, Huntsville, Alabama",,,,en,"This material may be protected under U. S. Copyright Law (Title 17, U.S. Code) which governs the making of photocopies or reproductions of copyrighted materials. You may use the digitized material for private study, scholarship, or research. Though the University of Alabama in Huntsville Archives and Special Collections has physical ownership of the material in its collections, in some cases we may not own the copyright to the material. It is the patron's obligation to determine and satisfy copyright restrictions when publishing or otherwise distributing materials found in our collections.",loc_jonh_2022,,,,,,,,,,,,,,,,,,,,,,,,,,,,,,,,,,,,,,,,,,,,,,,,,,,,,,,,,,,,,,,,,,,,,,,,,,,,,,,http://libarchstor2.uah.edu/digitalcollections/files/original/162/11277/loc_jonh_013591_013603.pdf,,"Limestone County",1,0
11274,http://libarchstor2.uah.edu/digitalcollections/items/show/11274,loc_jonh_013216_013244,"Architecture notebook 66: Co 55 Pettusville Rd in Limestone County, Ala.",,"Main house constructed in 1855. Dogtrot log cabin with limestone foundation. Greek revival sash and mantel. Moved in 1993 to 7 miles west of Athens, Ala.","Jones, Harvie P.",,,1980-1989^^1990-1999,,,"Architecture, Domestic^^Architecture--United States^^Dogtrot houses^^Athens (Ala.)^^Limestone County (Ala.)","Photograph albums^^Photographs^^Still Image^^Text",,"University of Alabama in Huntsville Archives, Special Collections, and Digital Initiatives, Huntsville, Alabama",,,,en,"This material may be protected under U. S. Copyright Law (Title 17, U.S. Code) which governs the making of photocopies or reproductions of copyrighted materials. You may use the digitized material for private study, scholarship, or research. Though the University of Alabama in Huntsville Archives and Special Collections has physical ownership of the material in its collections, in some cases we may not own the copyright to the material. It is the patron's obligation to determine and satisfy copyright restrictions when publishing or otherwise distributing materials found in our collections.",loc_jonh_2022,,,,,,,,,,,,,,,,,,,,,,,,,,,,,,,,,,,,,,,,,,,,,,,,,,,,,,,,,,,,,,,,,,,,,,,,,,,,,,,http://libarchstor2.uah.edu/digitalcollections/files/original/162/11274/loc_jonh_013216_013244.pdf,,"Limestone County",1,0
11273,http://libarchstor2.uah.edu/digitalcollections/items/show/11273,loc_jonh_013194_013215,"Architecture notebook 66: Blackburn House in Limestone County, Ala.",,"Main house constructed in 1873. Concrete block and back patio addition from 1982. Galvanized iron roof is modern. Vernacular component in a hanging quilting frame, typical of other 19th century homes in North Alabama. Located near Athens, Ala.","Jones, Harvie P.",,,1980-1989^^1990-1999,,,"Architecture, Domestic^^Architecture--United States^^Historic houses^^Athens (Ala.)^^Limestone County (Ala.)","Photograph albums^^Photographs^^Still Image^^Text",,"University of Alabama in Huntsville Archives, Special Collections, and Digital Initiatives, Huntsville, Alabama",,,,en,"This material may be protected under U. S. Copyright Law (Title 17, U.S. Code) which governs the making of photocopies or reproductions of copyrighted materials. You may use the digitized material for private study, scholarship, or research. Though the University of Alabama in Huntsville Archives and Special Collections has physical ownership of the material in its collections, in some cases we may not own the copyright to the material. It is the patron's obligation to determine and satisfy copyright restrictions when publishing or otherwise distributing materials found in our collections.",loc_jonh_2022,,,,,,,,,,,,,,,,,,,,,,,,,,,,,,,,,,,,,,,,,,,,,,,,,,,,,,,,,,,,,,,,,,,,,,,,,,,,,,,http://libarchstor2.uah.edu/digitalcollections/files/original/162/11273/loc_jonh_013194_013215.pdf,,"Limestone County",1,0
11272,http://libarchstor2.uah.edu/digitalcollections/items/show/11272,loc_jonh_012846_012854,"Architecture notebook 64: Goodwin House in Athens, Ala.",,"Goodwin house. Built in 1914. Has a tin roof. Located at 13545 New Cut Road in Athens, Ala.","Jones, Harvie P.",,,1980-1989^^1990-1999,,,"Architecture, Domestic^^Architecture--United States^^Historic houses^^Athens (Ala.)^^Limestone County (Ala.)","Photograph albums^^Photographs^^Still Image^^Text",,"University of Alabama in Huntsville Archives, Special Collections, and Digital Initiatives, Huntsville, Alabama",,,,en,"This material may be protected under U. S. Copyright Law (Title 17, U.S. Code) which governs the making of photocopies or reproductions of copyrighted materials. You may use the digitized material for private study, scholarship, or research. Though the University of Alabama in Huntsville Archives and Special Collections has physical ownership of the material in its collections, in some cases we may not own the copyright to the material. It is the patron's obligation to determine and satisfy copyright restrictions when publishing or otherwise distributing materials found in our collections.",loc_jonh_2022,,,,,,,,,,,,,,,,,,,,,,,,,,,,,,,,,,,,,,,,,,,,,,,,,,,,,,,,,,,,,,,,,,,,,,,,,,,,,,,http://libarchstor2.uah.edu/digitalcollections/files/original/162/11272/loc_jonh_012846_012854.pdf,,"Limestone County",1,0
9749,http://libarchstor2.uah.edu/digitalcollections/items/show/9749,loc_jonh_012577_012685,"Architecture notebook 63: Athens State College, in Athens, Alabama.",,"Athens State College, originally built in the 1830s renovation took place in 1979-80. Jones & Herrin, Architects worked on eight buildings including Founder's Hall (c. 1830), Brown Hall (c. 1900), Sanders Hall (early 20th century), Union Building (c. 1966), McCandless Hall (c. 1912), Houston Hall, Naylor Hall, and McCain Hall (c. 1940s). Located in Athens, Alabama.","Jones, Harvie P.",,,1980-1989^^1990-1999,,,"Architecture, Domestic^^Architecture--United States^^Auditoriums^^College buildings^^Details (components)^^Historic preservation^^School buildings^^School (buildings)^^Athens (Ala.)^^Limestone County (Ala.)","Photograph albums^^Photographs^^Still Image^^Text",,"Box 39, Folders 47-48^^University of Alabama in Huntsville Archives, Special Collections, and Digital Initiatives, Huntsville, Alabama",,,,en,"This material may be protected under U. S. Copyright Law (Title 17, U.S. Code) which governs the making of photocopies or reproductions of copyrighted materials. You may use the digitized material for private study, scholarship, or research. Though the University of Alabama in Huntsville Archives and Special Collections has physical ownership of the material in its collections, in some cases we may not own the copyright to the material. It is the patron's obligation to determine and satisfy copyright restrictions when publishing or otherwise distributing materials found in our collections.",loc_jonh_2021_12,,,,,,,,,,,,,,,,,,,,,,,,,,,,,,,,,,,,,,,,,,,,,,,,,,,,,,,,,,,,,,,,,,,,,,,,,,,,,,,http://libarchstor2.uah.edu/digitalcollections/files/original/162/9749/loc_jonh_012577_012685.pdf,,"Limestone County",1,0
