﻿"Item Id","Item URI","Dublin Core:Identifier","Dublin Core:Title","Dublin Core:Alternative Title","Dublin Core:Description","Dublin Core:Creator","Dublin Core:Publisher","Dublin Core:Date","Dublin Core:Temporal Coverage","Dublin Core:Coverage","Dublin Core:Spatial Coverage","Dublin Core:Subject","Dublin Core:Type","Dublin Core:Format","Dublin Core:Source","Dublin Core:Is Part Of","Dublin Core:Has Format","Dublin Core:Provenance","Dublin Core:Language","Dublin Core:Rights","Dublin Core:Relation","Dublin Core:Contributor","Dublin Core:Abstract","Dublin Core:Table Of Contents","Dublin Core:Date Available","Dublin Core:Date Created","Dublin Core:Date Accepted","Dublin Core:Date Copyrighted","Dublin Core:Date Submitted","Dublin Core:Date Issued","Dublin Core:Date Modified","Dublin Core:Date Valid","Dublin Core:Access Rights","Dublin Core:License","Dublin Core:Conforms To","Dublin Core:Has Part","Dublin Core:Has Version","Dublin Core:Is Format Of","Dublin Core:Is Referenced By","Dublin Core:Is Replaced By","Dublin Core:Is Required By","Dublin Core:Is Version Of","Dublin Core:References","Dublin Core:Replaces","Dublin Core:Requires","Dublin Core:Extent","Dublin Core:Medium","Dublin Core:Bibliographic Citation","Dublin Core:Accrual Method","Dublin Core:Accrual Periodicity","Dublin Core:Accrual Policy","Dublin Core:Audience","Dublin Core:Audience Education Level","Dublin Core:Mediator","Dublin Core:Instructional Method","Dublin Core:Rights Holder","Item Type Metadata:Text","Item Type Metadata:Interviewer","Item Type Metadata:Interviewee","Item Type Metadata:Location","Item Type Metadata:Transcription","Item Type Metadata:Local URL","Item Type Metadata:Original Format","Item Type Metadata:Physical Dimensions","Item Type Metadata:Duration","Item Type Metadata:Compression","Item Type Metadata:Producer","Item Type Metadata:Director","Item Type Metadata:Bit Rate/Frequency","Item Type Metadata:Time Summary","Item Type Metadata:Email Body","Item Type Metadata:Subject Line","Item Type Metadata:From","Item Type Metadata:To","Item Type Metadata:CC","Item Type Metadata:BCC","Item Type Metadata:Number of Attachments","Item Type Metadata:Standards","Item Type Metadata:Objectives","Item Type Metadata:Materials","Item Type Metadata:Lesson Plan Text","Item Type Metadata:URL","Item Type Metadata:Event Type","Item Type Metadata:Participants","Item Type Metadata:Birth Date","Item Type Metadata:Birthplace","Item Type Metadata:Death Date","Item Type Metadata:Occupation","Item Type Metadata:Biographical Text","Item Type Metadata:Bibliography","Item Type Metadata:Player","Item Type Metadata:Imported Thumbnail","Item Type Metadata:OHMS Object","Item Type Metadata:OHMS Object Text","Item Type Metadata:Interview Keyword","Item Type Metadata:Sort Priority","PDF Text:Text",Scripto:Transcription,tags,file,itemType,collection,public,featured
910,http://libarchstor2.uah.edu/digitalcollections/items/show/910,uah_lone_007_097,"U.S. Army Ordnance Missile Command Armed Forces Day 1961 After-Action Report.",,"The report outlines highlights of the Armed Forces Day, including attendance, media, and the parade lineup. The theme of the day was ""Power for Peace."" The report includes news clippings, a Redstone Arsenal welcome brochure, and photographs of the festivities in downtown Huntsville and at Redstone Arsenal.","United States. Army Ordnance Missile Command",,1961-06-05,1960-1969,,,"Aerospace industries^^Armed Forces Day^^Guided missiles^^Parades^^Soldiers^^Huntsville (Ala.)^^Redstone Arsenal (Ala.)^^Madison County (Ala.)","Clippings^^Photographs^^Still Image",,"Joel Lonergan Collection^^Box 1, Folder 4^^University of Alabama in Huntsville Archives, Special Collections, and Digital Initiatives, Huntsville, Alabama",,,"This item was digitized for the Apollo 11 50th anniversary celebration.",en,"This material may be protected under U. S. Copyright Law (Title 17, U.S. Code) which governs the making of photocopies or reproductions of copyrighted materials. You may use the digitized material for private study, scholarship, or research. Though the University of Alabama in Huntsville Archives and Special Collections has physical ownership of the material in its collections, in some cases we may not own the copyright to the material. It is the patron's obligation to determine and satisfy copyright restrictions when publishing or otherwise distributing materials found in our collections.",ap11_exhibit_2019_08,,,,,,,,,,,,,,,,,,,,,,,,,,,,,,,,,,,,,,,,,,,,,,,,,,,,,,,,,,,,,,,,,,,,,,,,,,,,,,,http://libarchstor2.uah.edu/digitalcollections/files/original/34/910/uah_lone_007_097.pdf,,"Joel Lonergan Collection",1,0
52,http://libarchstor2.uah.edu/digitalcollections/items/show/52,loc_hilt_000006_000042,"Transcript of a speech given by Wernher von Braun to the Alabama Legislature.",,"Von Braun, then the director of Marshall Space Flight Center in Huntsville, Alabama, delivered this speech to the legislature in 1961. In the speech, he emphasizes that Alabama must take advantage of its position in the aerospace industry and create a robust ""academic and research environment"" in Huntsville to attract businesses that ""will give birth to major new industries throughout the state."" He exhorts the legislature to fund the newly established University of Alabama Research Institute (now part of the University of Alabama in Huntsville), arguing that ""the Institute will not only be self-sustaining, but will enrich the State both financially and culturally."" The legislature later approved von Braun's request of $3 million for the Research Institute, enabling the purchase of 200 acres of land for the campus and the construction of the Institute in 1964. The speech includes copies of slides von Braun used during his presentation, including diagrams of Saturn and Nova rockets as well as a mockup of a Saturn rocket on the lawn of the state capitol in Montgomery.","Von Braun, Wernher, 1912-1977",,1961-06-21,1960-1969,,,"Aerospace industries^^Alabama. Legislature^^George C. Marshall Space Flight Center^^Saturn Project (U. S.)^^University of Alabama in Huntsville^^University of Alabama in Huntsville. Research Institute^^Huntsville (Ala.)^^Madison County (Ala.)","Photographs^^Speeches^^Transcripts^^Still Image^^Text",,"Heinz Hilten Collection^^Box 2^^University of Alabama in Huntsville Archives, Special Collections, and Digital Initiatives, Huntsville, Alabama",,,,en,"This material may be protected under U. S. Copyright Law (Title 17, U.S. Code) which governs the making of photocopies or reproductions of copyrighted materials. You may use the digitized material for private study, scholarship, or research. Though the University of Alabama in Huntsville Archives and Special Collections has physical ownership of the material in its collections, in some cases we may not own the copyright to the material. It is the patron's obligation to determine and satisfy copyright restrictions when publishing or otherwise distributing materials found in our collections.",,,,,,,,,,,,,,,,,,,,,,,,,,,,,,,,,,,,,,,,,,,,,,,,,,,,,,,,,,,,,,,,,,,,,,,,,,,,,,,,http://libarchstor2.uah.edu/digitalcollections/files/original/1/52/loc_hilt_0000006_0000042.pdf,,"Heinz Hilten Collection",1,0
11037,http://libarchstor2.uah.edu/digitalcollections/items/show/11037,Dxprior.pdf^^spc_stnv_000268,"DX priority: memorandum.",,"Memorandum discussing the priorization of various nlunar landing vehicle projects.","Kelley, A. J.",,1961-08-23,1960-1969,,,"Saturn project^^Apollo project^^Procurement^^Saturn launch vehicles^^Nova launch vehicles^^NASA space programs^^Aerospace industries^^Management",Text^^Memorandum,,"Saturn V Collection^^University of Alabama in Huntsville Archives, Special Collections, and Digital Initiatives, Huntsville, Alabama","Is part of: NASA HQ Miscellaneous Correspondence August 1968.",,,en,"This material may be protected under U. S. Copyright Law (Title 17, U.S. Code) which governs the making of photocopies or reproductions of copyrighted materials. You may use the digitized material for private study, scholarship, or research. Though the University of Alabama in Huntsville Archives and Special Collections has physical ownership of the material in its collections, in some cases we may not own the copyright to the material. It is the patron's obligation to determine and satisfy copyright restrictions when publishing or otherwise distributing materials found in our collections.",spc_stnv_000250_000274,,,,,,,,,,,,,,,,,,,,,,,,,,,,,,,,,,,,,,,,,,,,,,,,,,,,,,,,,,,,,,,,,,,,,,,,,,,,,,,http://libarchstor2.uah.edu/digitalcollections/files/original/20/11037/Dxprior_120108121209.pdf,,"Saturn V Collection",1,0
11074,http://libarchstor2.uah.edu/digitalcollections/items/show/11074,"coninqreg S-II-T.pdf^^spc_stnv_000211","Congressional inquiry regarding the S-II-T accident at the Mississippi Test Facility : letter to the honorable Clinton P. Anderson, Committee on Aeronautical and Space Science, United States Senate from James E. Webb, Administrator.",,"Archive copy is a photocopy.; Includes memorandum and information from George E. Mueller, Associate Administrator for Manned Space Flight. Letter contains handwritten editing and notes.","Webb, James E. (James Edwin), 1906-1992",,1967-03-21,1960-1969,,,"Saturn project^^Aerospace industries^^Accident investigation",Text^^Correspondences,,"Saturn V Collection^^University of Alabama in Huntsville Archives, Special Collections, and Digital Initiatives, Huntsville, Alabama",,,,en,"This material may be protected under U. S. Copyright Law (Title 17, U.S. Code) which governs the making of photocopies or reproductions of copyrighted materials. You may use the digitized material for private study, scholarship, or research. Though the University of Alabama in Huntsville Archives and Special Collections has physical ownership of the material in its collections, in some cases we may not own the copyright to the material. It is the patron's obligation to determine and satisfy copyright restrictions when publishing or otherwise distributing materials found in our collections.",spc_stnv_000200_000224,,,,,,,,,,,,,,,,,,,,,,,,,,,,,,,,,,,,,,,,,,,,,,,,,,,,,,,,,,,,,,,,,,,,,,,,,,,,,,,http://libarchstor2.uah.edu/digitalcollections/files/original/20/11074/coninqreg_S-II-T_021308134816.pdf,,"Saturn V Collection",1,0
10239,http://libarchstor2.uah.edu/digitalcollections/items/show/10239,welforaerappapandis_060707142709.pdf^^spc_stnv_000937,"""Welding for aerospace application : a panel discussion.""",,"Original is a photocopy;  W. A. Wilson, Chairman; Russell Meredith, North American Aviation; Robert Hackman, Linde Company; Frank Wallace, Pratt-Whitney Aircraft; P.G. Parks, NASA, MSFC; G. O. Hoglund, Aluminum Company of America.","Wilson, W. A.",,N/A,1960-1969,,,"Saturn project^^Welding^^Aerospace industries^^Standards",Text^^Transcriptions,,"Saturn V Collection^^University of Alabama in Huntsville Archives, Special Collections, and Digital Initiatives, Huntsville, Alabama","Is Part Of: Aerospace welding standards for the minutes of the meeting of American Ordnance Association.",,,en,"This material may be protected under U. S. Copyright Law (Title 17, U.S. Code) which governs the making of photocopies or reproductions of copyrighted materials. You may use the digitized material for private study, scholarship, or research. Though the University of Alabama in Huntsville Archives and Special Collections has physical ownership of the material in its collections, in some cases we may not own the copyright to the material. It is the patron's obligation to determine and satisfy copyright restrictions when publishing or otherwise distributing materials found in our collections.",spc_stnv_000925_000942,,,,,,,,,,,,,,,,,,,,,,,,,,,,,,,,,,,,,,,,,,,,,,,,,,,,,,,,,,,,,,,,,,,,,,,,,,,,,,,http://libarchstor2.uah.edu/digitalcollections/files/original/20/10239/welforaerappapandis_060707142709.pdf,,"Saturn V Collection",1,0
10371,http://libarchstor2.uah.edu/digitalcollections/items/show/10371,SkywSpacDiviVolXXIX15_052410123408.pdf^^spc_stnv_000825,"""Welcome back planned for 'Gum Drop' crew.""",,"A news article detailing the festivities planned upon the return of nine astronauts returning from a 10-day mission.","North American Aviation, Inc. Space Divisio^^Elliott, J.S.",,1969-04-04,1960-1969,,,"Saturn project^^Aerospace industries^^Employees^^Periodicals","Text^^News Articles",,"Saturn V Collection^^Box 31, Folder 15^^University of Alabama in Huntsville Archives, Special Collections, and Digital Initiatives, Huntsville, Alabama",,,,en,"This material may be protected under U. S. Copyright Law (Title 17, U.S. Code) which governs the making of photocopies or reproductions of copyrighted materials. You may use the digitized material for private study, scholarship, or research. Though the University of Alabama in Huntsville Archives and Special Collections has physical ownership of the material in its collections, in some cases we may not own the copyright to the material. It is the patron's obligation to determine and satisfy copyright restrictions when publishing or otherwise distributing materials found in our collections.",spc_stnv_000825_000849,,,,,,,,,,,,,,,,,,http://libarchstor.uah.edu:8081/repositories/2/archival_objects/18098,,,,,,,,,,,,,,,,,,,,,,,,,,,,,,,,,,,,,,,,,,,,,,,,,,,,,,,,,,,,,http://libarchstor2.uah.edu/digitalcollections/files/original/20/10371/SkywSpacDiviVolXXIX15_052410123408.pdf,,"Saturn V Collection",1,0
10418,http://libarchstor2.uah.edu/digitalcollections/items/show/10418,SkywSpacDiviVolXXIX14_052410124015.pdf^^spc_stnv_000824,"""Welcome back planned for 'Gum drop' crew.""",,"News article detailing the planned 'Welcome back' events surrounding the resturn of the Apollo 9 crew.","Elliott, J.S.^^North American Rockwell Corporation",,1969-04-04,1960-1969,,,"Saturn project^^Periodicals^^Aerospace industries^^Apollo project","Text^^News Articles",,"Saturn V Collection^^Box 31, Folder 13^^University of Alabama in Huntsville Archives, Special Collections, and Digital Initiatives, Huntsville, Alabama",,,,en,"This material may be protected under U. S. Copyright Law (Title 17, U.S. Code) which governs the making of photocopies or reproductions of copyrighted materials. You may use the digitized material for private study, scholarship, or research. Though the University of Alabama in Huntsville Archives and Special Collections has physical ownership of the material in its collections, in some cases we may not own the copyright to the material. It is the patron's obligation to determine and satisfy copyright restrictions when publishing or otherwise distributing materials found in our collections.",spc_stnv_000800_000824,,,,,,,,,,,,,,,,,,http://libarchstor.uah.edu:8081/repositories/2/archival_objects/18096,,,,,,,,,,,,,,,,,,,,,,,,,,,,,,,,,,,,,,,,,,,,,,,,,,,,,,,,,,,,,http://libarchstor2.uah.edu/digitalcollections/files/original/20/10418/SkywSpacDiviVolXXIX14_052410124015.pdf,,"Saturn V Collection",1,0
10284,http://libarchstor2.uah.edu/digitalcollections/items/show/10284,tooforaerapp_060707142010.pdf^^spc_stnv_000913,"""Tooling for aerospace application.""",,"Presented to the American Ordnance Association. A presentation on Saturn S-IC Tooling in order to demonstrate the trend towards larger tooling support. Focuses on the tank-structures primarily.","Mortimer, Edward P.",,1963-10-30,1960-1969,,,"Saturn project^^Aerospace industries^^Machining^^Saturn launch vehicles--Design and construction^^Tooling",Text^^Presentations,,"Saturn V Collection^^University of Alabama in Huntsville Archives, Special Collections, and Digital Initiatives, Huntsville, Alabama","Is Part Of: Aerospace welding standards for the minutes of the meeting of American Ordnance Association.",,,en,"This material may be protected under U. S. Copyright Law (Title 17, U.S. Code) which governs the making of photocopies or reproductions of copyrighted materials. You may use the digitized material for private study, scholarship, or research. Though the University of Alabama in Huntsville Archives and Special Collections has physical ownership of the material in its collections, in some cases we may not own the copyright to the material. It is the patron's obligation to determine and satisfy copyright restrictions when publishing or otherwise distributing materials found in our collections.",spc_stnv_000900_000924,,,,,,,,,,,,,,,,,,,,,,,,,,,,,,,,,,,,,,,,,,,,,,,,,,,,,,,,,,,,,,,,,,,,,,,,,,,,,,,http://libarchstor2.uah.edu/digitalcollections/files/original/20/10284/tooforaerapp_060707142010.pdf,,"Saturn V Collection",1,0
10413,http://libarchstor2.uah.edu/digitalcollections/items/show/10413,Skywritfeb1469_032210105433.pdf^^spc_stnv_000819,"""SII, with all spray foam insulation MTF-bound.""",,"News article detialing the innovation of the SII's design, specifically how it is made lighter.","Elliott, J. S.^^North American Rockwell Corporation",,1969-02-14,1960-1969,,,"Saturn project^^Periodicals^^Aerospace industries^^Apollo project","Text^^News Articles",,"Saturn V Collection^^Box 30, Folder 24^^University of Alabama in Huntsville Archives, Special Collections, and Digital Initiatives, Huntsville, Alabama",,,,en,"This material may be protected under U. S. Copyright Law (Title 17, U.S. Code) which governs the making of photocopies or reproductions of copyrighted materials. You may use the digitized material for private study, scholarship, or research. Though the University of Alabama in Huntsville Archives and Special Collections has physical ownership of the material in its collections, in some cases we may not own the copyright to the material. It is the patron's obligation to determine and satisfy copyright restrictions when publishing or otherwise distributing materials found in our collections.",spc_stnv_000800_000824,,,,,,,,,,,,,,,,,,http://libarchstor.uah.edu:8081/repositories/2/archival_objects/18074,,,,,,,,,,,,,,,,,,,,,,,,,,,,,,,,,,,,,,,,,,,,,,,,,,,,,,,,,,,,,http://libarchstor2.uah.edu/digitalcollections/files/original/20/10413/Skywritfeb1469_032210105433.pdf,,"Saturn V Collection",1,0
10564,http://libarchstor2.uah.edu/digitalcollections/items/show/10564,rptno25fragge_082707101519.pdf^^spc_stnv_000676,"""Security classification review of Saturn I/IB quarterly film report, no. 25.""",,"Memo to Mr. Lee Cropp informing that the subject film report was reviewed for security classification.","Fragge, Stanley L.",,1965-10-26,1960-1969,,,"Security classification^^Aerospace industries",Text^^Memorandums,,"Saturn V Collection^^University of Alabama in Huntsville Archives, Special Collections, and Digital Initiatives, Huntsville, Alabama","Uprated Saturn IB Quarterly film report and related materials #19, 20, 21, 22, 23, 24, 25, 26.",,,en,"This material may be protected under U. S. Copyright Law (Title 17, U.S. Code) which governs the making of photocopies or reproductions of copyrighted materials. You may use the digitized material for private study, scholarship, or research. Though the University of Alabama in Huntsville Archives and Special Collections has physical ownership of the material in its collections, in some cases we may not own the copyright to the material. It is the patron's obligation to determine and satisfy copyright restrictions when publishing or otherwise distributing materials found in our collections.",spc_stnv_000675_000699,,,,,,,,,,,,,,,,,,,,,,,,,,,,,,,,,,,,,,,,,,,,,,,,,,,,,,,,,,,,,,,,,,,,,,,,,,,,,,,http://libarchstor2.uah.edu/digitalcollections/files/original/20/10564/rptno25fragge_082707101519.pdf,,"Saturn V Collection",1,0
10565,http://libarchstor2.uah.edu/digitalcollections/items/show/10565,rptno25fragge_082707101519.pdf^^spc_stnv_000677,"""Security classification review of Saturn I/IB quarterly film report, no. 25.""",,"Memo to Mr. Lee Cropp, I-RM-D.","Fragge, Stanley L.",,1965-10-26,1960-1969,,,"Security classification^^Aerospace industries",Text^^Memorandums,,"Saturn V Collection^^University of Alabama in Huntsville Archives, Special Collections, and Digital Initiatives, Huntsville, Alabama","Uprated Saturn IB Quarterly film report and related materials #19, 20, 21, 22, 23, 24, 25, 26.",,,en,"This material may be protected under U. S. Copyright Law (Title 17, U.S. Code) which governs the making of photocopies or reproductions of copyrighted materials. You may use the digitized material for private study, scholarship, or research. Though the University of Alabama in Huntsville Archives and Special Collections has physical ownership of the material in its collections, in some cases we may not own the copyright to the material. It is the patron's obligation to determine and satisfy copyright restrictions when publishing or otherwise distributing materials found in our collections.",spc_stnv_000675_000699,,,,,,,,,,,,,,,,,,,,,,,,,,,,,,,,,,,,,,,,,,,,,,,,,,,,,,,,,,,,,,,,,,,,,,,,,,,,,,,http://libarchstor2.uah.edu/digitalcollections/files/original/20/10565/rptno25fragge_082707101519.pdf,,"Saturn V Collection",1,0
10669,http://libarchstor2.uah.edu/digitalcollections/items/show/10669,qtrlyrpt23_082707102252.pdf^^spc_stnv_000638,"""Security classification review of quarterly film report no. 23.""",,"Memo to Mr. Lee Cropp indicating that 'the film' had been reviewed and was deemed to contain no classified information.","Fragge, Stanley L.",,1965-05-11,1960-1969,,,"Saturn project^^Security classification^^Aerospace industries",Text^^Memorandums,,"Saturn V Collection^^University of Alabama in Huntsville Archives, Special Collections, and Digital Initiatives, Huntsville, Alabama",,,,en,"This material may be protected under U. S. Copyright Law (Title 17, U.S. Code) which governs the making of photocopies or reproductions of copyrighted materials. You may use the digitized material for private study, scholarship, or research. Though the University of Alabama in Huntsville Archives and Special Collections has physical ownership of the material in its collections, in some cases we may not own the copyright to the material. It is the patron's obligation to determine and satisfy copyright restrictions when publishing or otherwise distributing materials found in our collections.",spc_stnv_000625_000649,,,,,,,,,,,,,,,,,,,,,,,,,,,,,,,,,,,,,,,,,,,,,,,,,,,,,,,,,,,,,,,,,,,,,,,,,,,,,,,http://libarchstor2.uah.edu/digitalcollections/files/original/20/10669/qtrlyrpt23_082707102252.pdf,,"Saturn V Collection",1,0
10575,http://libarchstor2.uah.edu/digitalcollections/items/show/10575,satiibrptno26_082707095216.pdf^^spc_stnv_000687,"""Saturn I/IB quarterly film report no. 26.""",,"Memo is from Chief, Program Management Information, I-RM-D.;  The date and time of the interlock for the final I.O. approval is given.","Bullington, Marvin",,1966-02-01,1960-1969,,,"Aerospace industries",Text^^Memorandums,,"Saturn V Collection^^University of Alabama in Huntsville Archives, Special Collections, and Digital Initiatives, Huntsville, Alabama","Uprated Saturn IB Quarterly film report and related material #19, 20, 21, 22, 23, 24, 25, 26.",,,en,"This material may be protected under U. S. Copyright Law (Title 17, U.S. Code) which governs the making of photocopies or reproductions of copyrighted materials. You may use the digitized material for private study, scholarship, or research. Though the University of Alabama in Huntsville Archives and Special Collections has physical ownership of the material in its collections, in some cases we may not own the copyright to the material. It is the patron's obligation to determine and satisfy copyright restrictions when publishing or otherwise distributing materials found in our collections.",spc_stnv_000675_000699,,,,,,,,,,,,,,,,,,,,,,,,,,,,,,,,,,,,,,,,,,,,,,,,,,,,,,,,,,,,,,,,,,,,,,,,,,,,,,,http://libarchstor2.uah.edu/digitalcollections/files/original/20/10575/satiibrptno26_082707095216.pdf,,"Saturn V Collection",1,0