﻿"Item Id","Item URI","Dublin Core:Identifier","Dublin Core:Title","Dublin Core:Alternative Title","Dublin Core:Description","Dublin Core:Creator","Dublin Core:Publisher","Dublin Core:Date","Dublin Core:Temporal Coverage","Dublin Core:Coverage","Dublin Core:Spatial Coverage","Dublin Core:Subject","Dublin Core:Type","Dublin Core:Format","Dublin Core:Source","Dublin Core:Is Part Of","Dublin Core:Has Format","Dublin Core:Provenance","Dublin Core:Language","Dublin Core:Rights","Dublin Core:Relation","Dublin Core:Contributor","Dublin Core:Abstract","Dublin Core:Table Of Contents","Dublin Core:Date Available","Dublin Core:Date Created","Dublin Core:Date Accepted","Dublin Core:Date Copyrighted","Dublin Core:Date Submitted","Dublin Core:Date Issued","Dublin Core:Date Modified","Dublin Core:Date Valid","Dublin Core:Access Rights","Dublin Core:License","Dublin Core:Conforms To","Dublin Core:Has Part","Dublin Core:Has Version","Dublin Core:Is Format Of","Dublin Core:Is Referenced By","Dublin Core:Is Replaced By","Dublin Core:Is Required By","Dublin Core:Is Version Of","Dublin Core:References","Dublin Core:Replaces","Dublin Core:Requires","Dublin Core:Extent","Dublin Core:Medium","Dublin Core:Bibliographic Citation","Dublin Core:Accrual Method","Dublin Core:Accrual Periodicity","Dublin Core:Accrual Policy","Dublin Core:Audience","Dublin Core:Audience Education Level","Dublin Core:Mediator","Dublin Core:Instructional Method","Dublin Core:Rights Holder","Item Type Metadata:Text","Item Type Metadata:Interviewer","Item Type Metadata:Interviewee","Item Type Metadata:Location","Item Type Metadata:Transcription","Item Type Metadata:Local URL","Item Type Metadata:Original Format","Item Type Metadata:Physical Dimensions","Item Type Metadata:Duration","Item Type Metadata:Compression","Item Type Metadata:Producer","Item Type Metadata:Director","Item Type Metadata:Bit Rate/Frequency","Item Type Metadata:Time Summary","Item Type Metadata:Email Body","Item Type Metadata:Subject Line","Item Type Metadata:From","Item Type Metadata:To","Item Type Metadata:CC","Item Type Metadata:BCC","Item Type Metadata:Number of Attachments","Item Type Metadata:Standards","Item Type Metadata:Objectives","Item Type Metadata:Materials","Item Type Metadata:Lesson Plan Text","Item Type Metadata:URL","Item Type Metadata:Event Type","Item Type Metadata:Participants","Item Type Metadata:Birth Date","Item Type Metadata:Birthplace","Item Type Metadata:Death Date","Item Type Metadata:Occupation","Item Type Metadata:Biographical Text","Item Type Metadata:Bibliography","Item Type Metadata:Player","Item Type Metadata:Imported Thumbnail","Item Type Metadata:OHMS Object","Item Type Metadata:OHMS Object Text","Item Type Metadata:Interview Keyword","Item Type Metadata:Sort Priority","PDF Text:Text",Scripto:Transcription,tags,file,itemType,collection,public,featured
1673,http://libarchstor2.uah.edu/digitalcollections/items/show/1673,spc_mcca_000003,"Letter from the editor of the <i>Crimson-White</i> to the staff of the <i>Twilight Times</i>.",,"In this letter, John S. Neel, the summer editor of the <i> Crimson-White</i>, the University of Alabama's student newspaper, congratulates the staff of the student-led <i>Twilight Times</i> on their first issue. Neel mentions in the letter how impressive it is that these students are able to produce their paper when they ""are just going to school at night and holding down a regular job during the day.""","Neel, John S.",,1957-06-26,1950-1959,,,"Neel, John S.^^Student newspapers and periodicals^^Huntsville (Ala.)^^Madison County (Ala.)^^Tuscaloosa (Ala.)^^Tuscaloosa County (Ala.)",Correspondence^^Text,,"Christel L. McCanless Collection^^Box 1, Folder 1^^University of Alabama in Huntsville Archives, Special Collections, and Digital Initiatives, Huntsville, Alabama",,,,en,"This material may be protected under U. S. Copyright Law (Title 17, U.S. Code) which governs the making of photocopies or reproductions of copyrighted materials. You may use the digitized material for private study, scholarship, or research. Though the University of Alabama in Huntsville Archives and Special Collections has physical ownership of the material in its collections, in some cases we may not own the copyright to the material. It is the patron's obligation to determine and satisfy copyright restrictions when publishing or otherwise distributing materials found in our collections.",spc_mcca_2020_03,,,,,,,,,,,,,,,,,,,,,,,,,,,,,,,,,,,,,,,,,,,,,,,,,,,,,,,,,,,,,,,,,,,,,,,,,,,,,,,http://libarchstor2.uah.edu/digitalcollections/files/original/57/1673/spc_mcca_000003_web.pdf,,"Christel W. Ludewig McCanless Collection",1,0
7541,http://libarchstor2.uah.edu/digitalcollections/items/show/7541,r01c01-33,"Hunt, George H. to Cabaniss, Charles Eugene",,,"Hunt, George H.",,,1870-1879,,,"Subscriptions^^Shortages--currency^^Remittance ^^Tuscaloosa (Ala.)^^Episcopal Church--Alabama","Correspondence^^Postal card",,"Series 1, Subseries C, Box 1, Folder 33",,,,en,"This material may be protected under U. S. Copyright Law (Title 17, U.S. Code) which governs the making of photocopies or reproductions of copyrighted materials. You may use the digitized material for private study, scholarship, or research. Though the University of Alabama in Huntsville Archives and Special Collections has physical ownership of the material in its collections, in some cases we may not own the copyright to the material. It is the patron's obligation to determine and satisfy copyright restrictions when publishing or otherwise distributing materials found in our collections.",r01c-210910,,,,,,,,,,,,,,,,,,,,,,,,,,,,,,,,,,,,,,,,,,,,,,,,,,,,,,,,,,,,,,,,,,,,,,,,,,,,,,,http://dkdayton.net/roberts/images/r01c/pdfs/r01c01-33.pdf,"Still Image","Series 01, Subseries C: Cabaniss Personal Correspondence",1,0
11283,http://libarchstor2.uah.edu/digitalcollections/items/show/11283,loc_jonh_013970_013980,"Architecture notebook 74: Dearing House in Tuscaloosa, Ala.",,"Greek Revival style structure. Built in 1834 as the University Club by architect William Nichols. Balustrade removed prior to 1934 rehabilitation. Located at 421 Queen City Ave in Tuscaloosa, Ala.","Jones, Harvie P.",,,1980-1989^^1990-1999,,,"Architecture, Domestic^^Architecture--United States^^Historic houses^^Tuscaloosa (Ala.)^^Tuscaloosa County (Ala.)","Photograph albums^^Photographs^^Still Image^^Text",,"University of Alabama in Huntsville Archives, Special Collections, and Digital Initiatives, Huntsville, Alabama",,,,en,"This material may be protected under U. S. Copyright Law (Title 17, U.S. Code) which governs the making of photocopies or reproductions of copyrighted materials. You may use the digitized material for private study, scholarship, or research. Though the University of Alabama in Huntsville Archives and Special Collections has physical ownership of the material in its collections, in some cases we may not own the copyright to the material. It is the patron's obligation to determine and satisfy copyright restrictions when publishing or otherwise distributing materials found in our collections.",loc_jonh_2022,,,,,,,,,,,,,,,,,,,,,,,,,,,,,,,,,,,,,,,,,,,,,,,,,,,,,,,,,,,,,,,,,,,,,,,,,,,,,,,http://libarchstor2.uah.edu/digitalcollections/files/original/173/11283/loc_jonh_013970_013980.pdf,,"Tuscaloosa County",1,0
11282,http://libarchstor2.uah.edu/digitalcollections/items/show/11282,loc_jonh_013968_013969,"Architecture notebook 74: 1829 Alabama Capitol Building in Tuscaloosa, Ala.",,"Photos of the 1829 Alabama Capitol Building. Burned in 1923. Located in Tuscaloosa, Ala.","Jones, Harvie P.",,,1980-1989^^1990-1999,,,"Architecture, Domestic^^Architecture--United States^^Tuscaloosa (Ala.)^^Tuscaloosa County (Ala.)","Photograph albums^^Photographs^^Still Image^^Text",,"University of Alabama in Huntsville Archives, Special Collections, and Digital Initiatives, Huntsville, Alabama",,,,en,"This material may be protected under U. S. Copyright Law (Title 17, U.S. Code) which governs the making of photocopies or reproductions of copyrighted materials. You may use the digitized material for private study, scholarship, or research. Though the University of Alabama in Huntsville Archives and Special Collections has physical ownership of the material in its collections, in some cases we may not own the copyright to the material. It is the patron's obligation to determine and satisfy copyright restrictions when publishing or otherwise distributing materials found in our collections.",loc_jonh_2022,,,,,,,,,,,,,,,,,,,,,,,,,,,,,,,,,,,,,,,,,,,,,,,,,,,,,,,,,,,,,,,,,,,,,,,,,,,,,,,http://libarchstor2.uah.edu/digitalcollections/files/original/173/11282/loc_jonh_013968_013969.pdf,,"Tuscaloosa County",1,0
11280,http://libarchstor2.uah.edu/digitalcollections/items/show/11280,loc_jonh_013245_013300,"Architecture notebook 67: Gorgas House in Tuscaloosa, Ala.",,"Built in 1829 as a post office and dining hall. Became a professor's residence in 1847. Portico added in 1853. Enlarged in 1897. Located at Ninth and Capstone in Tuscaloosa, Ala.","Jones, Harvie P.",,,1980-1989^^1990-1999,,,"Architecture, Domestic^^Architecture--United States^^Historic house museums (buildings)^^Tuscaloosa (Ala.)^^Tuscaloosa County (Ala.)","Photograph albums^^Photographs^^Still Image^^Text",,"University of Alabama in Huntsville Archives, Special Collections, and Digital Initiatives, Huntsville, Alabama",,,,en,"This material may be protected under U. S. Copyright Law (Title 17, U.S. Code) which governs the making of photocopies or reproductions of copyrighted materials. You may use the digitized material for private study, scholarship, or research. Though the University of Alabama in Huntsville Archives and Special Collections has physical ownership of the material in its collections, in some cases we may not own the copyright to the material. It is the patron's obligation to determine and satisfy copyright restrictions when publishing or otherwise distributing materials found in our collections.",loc_jonh_2022,,,,,,,,,,,,,,,,,,,,,,,,,,,,,,,,,,,,,,,,,,,,,,,,,,,,,,,,,,,,,,,,,,,,,,,,,,,,,,,http://libarchstor2.uah.edu/digitalcollections/files/original/173/11280/loc_jonh_013245_013300.pdf,,"Tuscaloosa County",1,0
9723,http://libarchstor2.uah.edu/digitalcollections/items/show/9723,loc_jonh_011886_012020,"Architecture notebook 59: Marmaduke-Williams House, at 907 17th Ave., Tuscaloosa, Alabama.",,"Marmaduke-Williams House, built in 1838, also known as the Owen-Williams-Brown House. Land was once owned by the University of Alabama. Built by Thomas Owens shortly after purchasing the land. Owens moved to Aberdeen, Mississippi upon the purchase of a plantation and this house was occupied by his in-laws, the Marmaduke Williams. During the renovation project (1994-1997) in 1996, the house was the victim of arson and destroyed the interior. A previous fire 1992 had already caused considerable damage. Located at 907 17th Ave., Tuscaloosa, Alabama.","Jones, Harvie P.",,,1980-1989^^1990-1999,,,"Architecture, Domestic^^Architecture--United States^^Dwellings^^Historic houses^^Historic preservation^^Tuscaloosa (Ala.)^^Tuscaloosa County (Ala.)","Photograph albums^^Photographs^^Still Image^^Text",,"Box 39, Folder 22^^University of Alabama in Huntsville Archives, Special Collections, and Digital Initiatives, Huntsville, Alabama",,,,en,"This material may be protected under U. S. Copyright Law (Title 17, U.S. Code) which governs the making of photocopies or reproductions of copyrighted materials. You may use the digitized material for private study, scholarship, or research. Though the University of Alabama in Huntsville Archives and Special Collections has physical ownership of the material in its collections, in some cases we may not own the copyright to the material. It is the patron's obligation to determine and satisfy copyright restrictions when publishing or otherwise distributing materials found in our collections.",loc_jonh_2021_12,,,,,,,,,,,,,,,,,,,,,,,,,,,,,,,,,,,,,,,,,,,,,,,,,,,,,,,,,,,,,,,,,,,,,,,,,,,,,,,http://libarchstor2.uah.edu/digitalcollections/files/original/173/9723/loc_jonh_011886_012020.pdf,,"Tuscaloosa County",1,0
9697,http://libarchstor2.uah.edu/digitalcollections/items/show/9697,loc_jonh_011145_011211,"Architecture notebook 56: Miller House, at 1601 Alaca Place, Tuscaloosa,  Alabama.",,"The Miller House, also known as the Miller-Harrison-Laseter House, built in 1857, is a two-story house build in the shape of a Maltese Cross with three entrances and three porches. Utilizes Gothic architectural details. Located at 1601 Alaca Place, Tuscaloosa, Alabama.","Jones, Harvie P.",,,1980-1989^^1990-1999,,,"Architecture, Domestic^^Architecture--United States^^Details (components)^^Dwellings^^Historic houses^^Historic preservation^^Tuscaloosa (Ala.)^^Tuscaloosa County (Ala.)","Photograph albums^^Photographs^^Still Image^^Text",,"Box 38, Folder 21^^University of Alabama in Huntsville Archives, Special Collections, and Digital Initiatives, Huntsville, Alabama",,,,en,"This material may be protected under U. S. Copyright Law (Title 17, U.S. Code) which governs the making of photocopies or reproductions of copyrighted materials. You may use the digitized material for private study, scholarship, or research. Though the University of Alabama in Huntsville Archives and Special Collections has physical ownership of the material in its collections, in some cases we may not own the copyright to the material. It is the patron's obligation to determine and satisfy copyright restrictions when publishing or otherwise distributing materials found in our collections.",loc_jonh_2021_12,,,,,,,,,,,,,,,,,,,,,,,,,,,,,,,,,,,,,,,,,,,,,,,,,,,,,,,,,,,,,,,,,,,,,,,,,,,,,,,http://libarchstor2.uah.edu/digitalcollections/files/original/173/9697/loc_jonh_011145_011211.pdf,,"Tuscaloosa County",1,0
9647,http://libarchstor2.uah.edu/digitalcollections/items/show/9647,loc_jonh_006955_007792,"Architecture notebook 36: Jemison House, or the Jemison-Van de Graaff Mansion, or the Friedman Library, at 1305 Greensboro Ave., Tuscaloosa, Alabama.",,"Jemison House, also known as the Jemison-Van de Graaff Mansion or the Friedman Library, built c. 1860. Italiante style. Built by Robert Jemison Jr., an Alabama and Confederate Senator, and designed by the firm of Samuel Sloan and John S. Stewart. Includes a servants house. Located at 1305 Greensboro Ave. in Tuscaloosa, Alabama.","Jones, Harvie P.",,,1980-1989^^1990-1999,,,"Architecture, Domestic^^Architecture--United States^^Dwellings^^Historic houses^^Historic preservation^^Outbuildings^^Tuscaloosa (Ala.)^^Tuscaloosa County (Ala.)","Photograph albums^^Photographs^^Still Image^^Text",,"Box 35, Folder 25^^Box 36, Folders 1-4^^University of Alabama in Huntsville Archives, Special Collections, and Digital Initiatives, Huntsville, Alabama",,,,en,"This material may be protected under U. S. Copyright Law (Title 17, U.S. Code) which governs the making of photocopies or reproductions of copyrighted materials. You may use the digitized material for private study, scholarship, or research. Though the University of Alabama in Huntsville Archives and Special Collections has physical ownership of the material in its collections, in some cases we may not own the copyright to the material. It is the patron's obligation to determine and satisfy copyright restrictions when publishing or otherwise distributing materials found in our collections.",loc_jonh_2021_11D,,,,,,,,,,,,,,,,,,,,,,,,,,,,,,,,,,,,,,,,,,,,,,,,,,,,,,,,,,,,,,,,,,,,,,,,,,,,,,,http://libarchstor2.uah.edu/digitalcollections/files/original/173/9647/loc_jonh_006955_007792.pdf,,"Tuscaloosa County",1,0
9622,http://libarchstor2.uah.edu/digitalcollections/items/show/9622,loc_jonh_003939_003961,"Architecture notebook 22: Dearing-Swain House, in Tuscaloosa, Alabama.",,"Dearing-Swain House, built post-1846 by A.B. Dearing. Greek Revival style. Located in Tuscaloosa, Alabama.","Jones, Harvie P.",,,1980-1989^^1990-1999,,,"Architecture, Domestic^^Architecture--United States^^Dwellings^^Historic preservation^^Tuscaloosa (Ala.)^^Tuscaloosa County (Ala.)","Photograph albums^^Photographs^^Still Image^^Text",,"Box 33, Folder 24^^University of Alabama in Huntsville Archives, Special Collections, and Digital Initiatives, Huntsville, Alabama",,,,en,"This material may be protected under U. S. Copyright Law (Title 17, U.S. Code) which governs the making of photocopies or reproductions of copyrighted materials. You may use the digitized material for private study, scholarship, or research. Though the University of Alabama in Huntsville Archives and Special Collections has physical ownership of the material in its collections, in some cases we may not own the copyright to the material. It is the patron's obligation to determine and satisfy copyright restrictions when publishing or otherwise distributing materials found in our collections.",loc_jonh_2021_11C,,,,,,,,,,,,,,,,,,,,,,,,,,,,,,,,,,,,,,,,,,,,,,,,,,,,,,,,,,,,,,,,,,,,,,,,,,,,,,,http://libarchstor2.uah.edu/digitalcollections/files/original/173/9622/loc_jonh_003939_003961.pdf,,"Tuscaloosa County",1,0
