﻿"Item Id","Item URI","Dublin Core:Identifier","Dublin Core:Title","Dublin Core:Alternative Title","Dublin Core:Description","Dublin Core:Creator","Dublin Core:Publisher","Dublin Core:Date","Dublin Core:Temporal Coverage","Dublin Core:Coverage","Dublin Core:Spatial Coverage","Dublin Core:Subject","Dublin Core:Type","Dublin Core:Format","Dublin Core:Source","Dublin Core:Is Part Of","Dublin Core:Has Format","Dublin Core:Provenance","Dublin Core:Language","Dublin Core:Rights","Dublin Core:Relation","Dublin Core:Contributor","Dublin Core:Abstract","Dublin Core:Table Of Contents","Dublin Core:Date Available","Dublin Core:Date Created","Dublin Core:Date Accepted","Dublin Core:Date Copyrighted","Dublin Core:Date Submitted","Dublin Core:Date Issued","Dublin Core:Date Modified","Dublin Core:Date Valid","Dublin Core:Access Rights","Dublin Core:License","Dublin Core:Conforms To","Dublin Core:Has Part","Dublin Core:Has Version","Dublin Core:Is Format Of","Dublin Core:Is Referenced By","Dublin Core:Is Replaced By","Dublin Core:Is Required By","Dublin Core:Is Version Of","Dublin Core:References","Dublin Core:Replaces","Dublin Core:Requires","Dublin Core:Extent","Dublin Core:Medium","Dublin Core:Bibliographic Citation","Dublin Core:Accrual Method","Dublin Core:Accrual Periodicity","Dublin Core:Accrual Policy","Dublin Core:Audience","Dublin Core:Audience Education Level","Dublin Core:Mediator","Dublin Core:Instructional Method","Dublin Core:Rights Holder","Item Type Metadata:Text","Item Type Metadata:Interviewer","Item Type Metadata:Interviewee","Item Type Metadata:Location","Item Type Metadata:Transcription","Item Type Metadata:Local URL","Item Type Metadata:Original Format","Item Type Metadata:Physical Dimensions","Item Type Metadata:Duration","Item Type Metadata:Compression","Item Type Metadata:Producer","Item Type Metadata:Director","Item Type Metadata:Bit Rate/Frequency","Item Type Metadata:Time Summary","Item Type Metadata:Email Body","Item Type Metadata:Subject Line","Item Type Metadata:From","Item Type Metadata:To","Item Type Metadata:CC","Item Type Metadata:BCC","Item Type Metadata:Number of Attachments","Item Type Metadata:Standards","Item Type Metadata:Objectives","Item Type Metadata:Materials","Item Type Metadata:Lesson Plan Text","Item Type Metadata:URL","Item Type Metadata:Event Type","Item Type Metadata:Participants","Item Type Metadata:Birth Date","Item Type Metadata:Birthplace","Item Type Metadata:Death Date","Item Type Metadata:Occupation","Item Type Metadata:Biographical Text","Item Type Metadata:Bibliography","Item Type Metadata:Player","Item Type Metadata:Imported Thumbnail","Item Type Metadata:OHMS Object","Item Type Metadata:OHMS Object Text","Item Type Metadata:Interview Keyword","Item Type Metadata:Sort Priority","PDF Text:Text",Scripto:Transcription,tags,file,itemType,collection,public,featured
4802,http://libarchstor2.uah.edu/digitalcollections/items/show/4802,spc_bens_000003_000035,"""Scientific Instruments for a Soft Landing Stationary and Mobile Lunar Vehicle.""",,"This paper by John Bensko and other members of the lunar research group provides preliminary information on scientific instrumentation used for lunar exploration. ","Bensko, John, Jr.",,1959-07-31,1950-1959,,,"Apollo Lunar Surface Drill^^Lunar surface samples^^Research^^Huntsville (Ala.)^^Madison County (Ala.)","Photographs^^Still Image",,"John Bensko, Jr. Collection^^University of Alabama in Huntsville Archives, Special Collections, and Digital Initiatives, Huntsville, Alabama",,,,en,"This material may be protected under U. S. Copyright Law (Title 17, U.S. Code) which governs the making of photocopies or reproductions of copyrighted materials. You may use the digitized material for private study, scholarship, or research. Though the University of Alabama in Huntsville Archives and Special Collections has physical ownership of the material in its collections, in some cases we may not own the copyright to the material. It is the patron's obligation to determine and satisfy copyright restrictions when publishing or otherwise distributing materials found in our collections.",spc_bens_2021_05,,,,,,,,,,,,,,,,,,,,,,,,,,,,,,,,,,,,,,,,,,,,,,,,,,,,,,,,,,,,,,,,,,,,,,,,,,,,,,,http://libarchstor2.uah.edu/digitalcollections/files/original/42/4802/spc_bens_000003_000035.pdf,,"John Bensko, Jr. Collection",1,0
11091,http://libarchstor2.uah.edu/digitalcollections/items/show/11091,univreseinstcont_062107153638.pdf,"""University and research institute contracts awarded by MSFC.""",,"This is a list of contract numbers, contractor, subject and RNT contact.","George C.  Marshall Space Flight Center",,1961-01-24,1960-1969,,,"Saturn project^^Contracts^^Research",Text^^Lists,,"Saturn V Collection^^Box 10, Folder 31^^University of Alabama in Huntsville Archives, Special Collections, and Digital Initiatives, Huntsville, Alabama",,,,en,"This material may be protected under U. S. Copyright Law (Title 17, U.S. Code) which governs the making of photocopies or reproductions of copyrighted materials. You may use the digitized material for private study, scholarship, or research. Though the University of Alabama in Huntsville Archives and Special Collections has physical ownership of the material in its collections, in some cases we may not own the copyright to the material. It is the patron's obligation to determine and satisfy copyright restrictions when publishing or otherwise distributing materials found in our collections.",spc_stnv_000900_000924,,,,,,,,,,,,,,,,,,http://libarchstor.uah.edu:8081/repositories/2/archival_objects/16903,,,,,,,,,,,,,,,,,,,,,,,,,,,,,,,,,,,,,,,,,,,,,,,,,,,,,,,,,,,,,http://libarchstor2.uah.edu/digitalcollections/files/original/20/11091/univreseinstcont_062107153638.pdf,,"Saturn V Collection",1,0
4801,http://libarchstor2.uah.edu/digitalcollections/items/show/4801,spc_bens_000002_000002,"Photo of a lunar drill bit.",,"This photo shows a grooved lunar drill bit as it is being tested on a block of lunar material.","Bensko, John, Jr.",,1966,1960-1969,,,"Apollo Lunar Surface Drill^^Lunar surface samples^^Research^^Huntsville (Ala.)^^Madison County (Ala.)","Photographs^^Still Image",,"John Bensko, Jr. Collection^^University of Alabama in Huntsville Archives, Special Collections, and Digital Initiatives, Huntsville, Alabama",,,,en,"This material may be protected under U. S. Copyright Law (Title 17, U.S. Code) which governs the making of photocopies or reproductions of copyrighted materials. You may use the digitized material for private study, scholarship, or research. Though the University of Alabama in Huntsville Archives and Special Collections has physical ownership of the material in its collections, in some cases we may not own the copyright to the material. It is the patron's obligation to determine and satisfy copyright restrictions when publishing or otherwise distributing materials found in our collections.",spc_bens_2021_05,,,,,,,,,,,,,,,,,,,,,,,,,,,,,,,,,,,,,,,,,,,,,,,,,,,,,,,,,,,,,,,,,,,,,,,,,,,,,,,http://libarchstor2.uah.edu/digitalcollections/files/original/42/4801/spc_bens_000002_000002.pdf,,"John Bensko, Jr. Collection",1,0
4826,http://libarchstor2.uah.edu/digitalcollections/items/show/4826,spc_bens_000064_000064,"Photo of a lunar drill bit.",CP18819,"This photograph shows a drill bit for the lunar drill.","Bensko, John, Jr.",,1969,1960-1969,,,"Apollo Lunar Surface Drill^^Lunar surface samples^^Research^^Huntsville (Ala.)^^Madison County (Ala.)","Photographs^^Still Image",,"John Bensko, Jr. Collection^^University of Alabama in Huntsville Archives, Special Collections, and Digital Initiatives, Huntsville, Alabama",,,,en,"This material may be protected under U. S. Copyright Law (Title 17, U.S. Code) which governs the making of photocopies or reproductions of copyrighted materials. You may use the digitized material for private study, scholarship, or research. Though the University of Alabama in Huntsville Archives and Special Collections has physical ownership of the material in its collections, in some cases we may not own the copyright to the material. It is the patron's obligation to determine and satisfy copyright restrictions when publishing or otherwise distributing materials found in our collections.",spc_bens_2021_05,,,,,,,,,,,,,,,,,,,,,,,,,,,,,,,,,,,,,,,,,,,,,,,,,,,,,,,,,,,,,,,,,,,,,,,,,,,,,,,http://libarchstor2.uah.edu/digitalcollections/files/original/42/4826/spc_bens_000064_000064.pdf,,"John Bensko, Jr. Collection",1,0
4827,http://libarchstor2.uah.edu/digitalcollections/items/show/4827,spc_bens_000065_000065,"Photo of a lunar drill bit.",CP19022,"This photograph shows a drill bit for the lunar drill.","Bensko, John, Jr.",,1969,1960-1969,,,"Apollo Lunar Surface Drill^^Lunar surface samples^^Research^^Huntsville (Ala.)^^Madison County (Ala.)","Photographs^^Still Image",,"John Bensko, Jr. Collection^^University of Alabama in Huntsville Archives, Special Collections, and Digital Initiatives, Huntsville, Alabama",,,,en,"This material may be protected under U. S. Copyright Law (Title 17, U.S. Code) which governs the making of photocopies or reproductions of copyrighted materials. You may use the digitized material for private study, scholarship, or research. Though the University of Alabama in Huntsville Archives and Special Collections has physical ownership of the material in its collections, in some cases we may not own the copyright to the material. It is the patron's obligation to determine and satisfy copyright restrictions when publishing or otherwise distributing materials found in our collections.",spc_bens_2021_05,,,,,,,,,,,,,,,,,,,,,,,,,,,,,,,,,,,,,,,,,,,,,,,,,,,,,,,,,,,,,,,,,,,,,,,,,,,,,,,http://libarchstor2.uah.edu/digitalcollections/files/original/42/4827/spc_bens_000065_000065.pdf,,"John Bensko, Jr. Collection",1,0
4831,http://libarchstor2.uah.edu/digitalcollections/items/show/4831,spc_bens_000069_000069,"Photo of a lunar drill bit.",18888,"This photographs shows a lunar drill bit from the bottom angle.","Bensko, John, Jr.",,1969,1960-1969,,,"Apollo Lunar Surface Drill^^Lunar surface samples^^Research^^Huntsville (Ala.)^^Madison County (Ala.)","Photographs^^Still Image",,"John Bensko, Jr. Collection^^University of Alabama in Huntsville Archives, Special Collections, and Digital Initiatives, Huntsville, Alabama",,,,en,"This material may be protected under U. S. Copyright Law (Title 17, U.S. Code) which governs the making of photocopies or reproductions of copyrighted materials. You may use the digitized material for private study, scholarship, or research. Though the University of Alabama in Huntsville Archives and Special Collections has physical ownership of the material in its collections, in some cases we may not own the copyright to the material. It is the patron's obligation to determine and satisfy copyright restrictions when publishing or otherwise distributing materials found in our collections.",spc_bens_2021_05,,,,,,,,,,,,,,,,,,,,,,,,,,,,,,,,,,,,,,,,,,,,,,,,,,,,,,,,,,,,,,,,,,,,,,,,,,,,,,,http://libarchstor2.uah.edu/digitalcollections/files/original/42/4831/spc_bens_000069_000069.pdf,,"John Bensko, Jr. Collection",1,0
4835,http://libarchstor2.uah.edu/digitalcollections/items/show/4835,spc_bens_000073_000073,"Photo of a lunar drill bit.",,"This photograph shows a drill bit for the lunar drill.","Bensko, John, Jr.",,1969,1960-1969,,,"Apollo Lunar Surface Drill^^Lunar surface samples^^Research^^Huntsville (Ala.)^^Madison County (Ala.)","Photographs^^Still Image",,"John Bensko, Jr. Collection^^University of Alabama in Huntsville Archives, Special Collections, and Digital Initiatives, Huntsville, Alabama",,,,en,"This material may be protected under U. S. Copyright Law (Title 17, U.S. Code) which governs the making of photocopies or reproductions of copyrighted materials. You may use the digitized material for private study, scholarship, or research. Though the University of Alabama in Huntsville Archives and Special Collections has physical ownership of the material in its collections, in some cases we may not own the copyright to the material. It is the patron's obligation to determine and satisfy copyright restrictions when publishing or otherwise distributing materials found in our collections.",spc_bens_2021_05,,,,,,,,,,,,,,,,,,,,,,,,,,,,,,,,,,,,,,,,,,,,,,,,,,,,,,,,,,,,,,,,,,,,,,,,,,,,,,,http://libarchstor2.uah.edu/digitalcollections/files/original/42/4835/spc_bens_000073_000073.pdf,,"John Bensko, Jr. Collection",1,0
4837,http://libarchstor2.uah.edu/digitalcollections/items/show/4837,spc_bens_000076_000076,"Photo of a lunar drill bit.",CP18818,"This photograph shows a lunar drill bit being held/measured by another instrument.","Bensko, John, Jr.",,1969,1960-1969,,,"Apollo Lunar Surface Drill^^Lunar surface samples^^Research^^Huntsville (Ala.)^^Madison County (Ala.)","Photographs^^Still Image",,"John Bensko, Jr. Collection^^University of Alabama in Huntsville Archives, Special Collections, and Digital Initiatives, Huntsville, Alabama",,,,en,"This material may be protected under U. S. Copyright Law (Title 17, U.S. Code) which governs the making of photocopies or reproductions of copyrighted materials. You may use the digitized material for private study, scholarship, or research. Though the University of Alabama in Huntsville Archives and Special Collections has physical ownership of the material in its collections, in some cases we may not own the copyright to the material. It is the patron's obligation to determine and satisfy copyright restrictions when publishing or otherwise distributing materials found in our collections.",spc_bens_2021_05,,,,,,,,,,,,,,,,,,,,,,,,,,,,,,,,,,,,,,,,,,,,,,,,,,,,,,,,,,,,,,,,,,,,,,,,,,,,,,,http://libarchstor2.uah.edu/digitalcollections/files/original/42/4837/spc_bens_000076_000076.pdf,,"John Bensko, Jr. Collection",1,0
4805,http://libarchstor2.uah.edu/digitalcollections/items/show/4805,spc_bens_000038_000038,"Photo of a lunar drill part.",CP18830,"This photograph shows a separate part that makes up the lunar drill.","Bensko, John, Jr.",,1969,1960-1969,,,"Apollo Lunar Surface Drill^^Lunar surface samples^^Research^^Huntsville (Ala.)^^Madison County (Ala.)","Photographs^^Still Image",,"John Bensko, Jr. Collection^^University of Alabama in Huntsville Archives, Special Collections, and Digital Initiatives, Huntsville, Alabama",,,,en,"This material may be protected under U. S. Copyright Law (Title 17, U.S. Code) which governs the making of photocopies or reproductions of copyrighted materials. You may use the digitized material for private study, scholarship, or research. Though the University of Alabama in Huntsville Archives and Special Collections has physical ownership of the material in its collections, in some cases we may not own the copyright to the material. It is the patron's obligation to determine and satisfy copyright restrictions when publishing or otherwise distributing materials found in our collections.",spc_bens_2021_05,,,,,,,,,,,,,,,,,,,,,,,,,,,,,,,,,,,,,,,,,,,,,,,,,,,,,,,,,,,,,,,,,,,,,,,,,,,,,,,http://libarchstor2.uah.edu/digitalcollections/files/original/42/4805/spc_bens_000038_000038.pdf,,"John Bensko, Jr. Collection",1,0
4806,http://libarchstor2.uah.edu/digitalcollections/items/show/4806,spc_bens_000039_000039,"Photo of a lunar drill part.",CP18812,"This photograph shows a separate part that makes up the lunar drill.","Bensko, John, Jr.",,1969,1960-1969,,,"Apollo Lunar Surface Drill^^Lunar surface samples^^Research^^Huntsville (Ala.)^^Madison County (Ala.)","Photographs^^Still Image",,"John Bensko, Jr. Collection^^University of Alabama in Huntsville Archives, Special Collections, and Digital Initiatives, Huntsville, Alabama",,,,en,"This material may be protected under U. S. Copyright Law (Title 17, U.S. Code) which governs the making of photocopies or reproductions of copyrighted materials. You may use the digitized material for private study, scholarship, or research. Though the University of Alabama in Huntsville Archives and Special Collections has physical ownership of the material in its collections, in some cases we may not own the copyright to the material. It is the patron's obligation to determine and satisfy copyright restrictions when publishing or otherwise distributing materials found in our collections.",spc_bens_2021_05,,,,,,,,,,,,,,,,,,,,,,,,,,,,,,,,,,,,,,,,,,,,,,,,,,,,,,,,,,,,,,,,,,,,,,,,,,,,,,,http://libarchstor2.uah.edu/digitalcollections/files/original/42/4806/spc_bens_000039_000039.pdf,,"John Bensko, Jr. Collection",1,0
4807,http://libarchstor2.uah.edu/digitalcollections/items/show/4807,spc_bens_000040_000040,"Photo of a lunar drill part.",CP18829,"This photograph shows a separate part that makes up the lunar drill.","Bensko, John, Jr.",,1969,1960-1969,,,"Apollo Lunar Surface Drill^^Lunar surface samples^^Research^^Huntsville (Ala.)^^Madison County (Ala.)","Photographs^^Still Image",,"John Bensko, Jr. Collection^^University of Alabama in Huntsville Archives, Special Collections, and Digital Initiatives, Huntsville, Alabama",,,,en,"This material may be protected under U. S. Copyright Law (Title 17, U.S. Code) which governs the making of photocopies or reproductions of copyrighted materials. You may use the digitized material for private study, scholarship, or research. Though the University of Alabama in Huntsville Archives and Special Collections has physical ownership of the material in its collections, in some cases we may not own the copyright to the material. It is the patron's obligation to determine and satisfy copyright restrictions when publishing or otherwise distributing materials found in our collections.",spc_bens_2021_05,,,,,,,,,,,,,,,,,,,,,,,,,,,,,,,,,,,,,,,,,,,,,,,,,,,,,,,,,,,,,,,,,,,,,,,,,,,,,,,http://libarchstor2.uah.edu/digitalcollections/files/original/42/4807/spc_bens_000040_000040.pdf,,"John Bensko, Jr. Collection",1,0
4810,http://libarchstor2.uah.edu/digitalcollections/items/show/4810,spc_bens_000045_000045,"Photo of a lunar drill part.",CP18807,"This photograph shows a separate part that makes up the lunar drill.","Bensko, John, Jr.",,1969,1960-1969,,,"Apollo Lunar Surface Drill^^Lunar surface samples^^Research^^Huntsville (Ala.)^^Madison County (Ala.)","Photographs^^Still Image",,"John Bensko, Jr. Collection^^University of Alabama in Huntsville Archives, Special Collections, and Digital Initiatives, Huntsville, Alabama",,,,en,"This material may be protected under U. S. Copyright Law (Title 17, U.S. Code) which governs the making of photocopies or reproductions of copyrighted materials. You may use the digitized material for private study, scholarship, or research. Though the University of Alabama in Huntsville Archives and Special Collections has physical ownership of the material in its collections, in some cases we may not own the copyright to the material. It is the patron's obligation to determine and satisfy copyright restrictions when publishing or otherwise distributing materials found in our collections.",spc_bens_2021_05,,,,,,,,,,,,,,,,,,,,,,,,,,,,,,,,,,,,,,,,,,,,,,,,,,,,,,,,,,,,,,,,,,,,,,,,,,,,,,,http://libarchstor2.uah.edu/digitalcollections/files/original/42/4810/spc_bens_000045_000045.pdf,,"John Bensko, Jr. Collection",1,0
4816,http://libarchstor2.uah.edu/digitalcollections/items/show/4816,spc_bens_000051_000051,"Photo of a lunar drill part.",18909,"This photograph shows a separate part that makes up the lunar drill.","Bensko, John, Jr.",,1969,1960-1969,,,"Apollo Lunar Surface Drill^^Lunar surface samples^^Research^^Huntsville (Ala.)^^Madison County (Ala.)","Photographs^^Still Image",,"John Bensko, Jr. Collection^^University of Alabama in Huntsville Archives, Special Collections, and Digital Initiatives, Huntsville, Alabama",,,,en,"This material may be protected under U. S. Copyright Law (Title 17, U.S. Code) which governs the making of photocopies or reproductions of copyrighted materials. You may use the digitized material for private study, scholarship, or research. Though the University of Alabama in Huntsville Archives and Special Collections has physical ownership of the material in its collections, in some cases we may not own the copyright to the material. It is the patron's obligation to determine and satisfy copyright restrictions when publishing or otherwise distributing materials found in our collections.",spc_bens_2021_05,,,,,,,,,,,,,,,,,,,,,,,,,,,,,,,,,,,,,,,,,,,,,,,,,,,,,,,,,,,,,,,,,,,,,,,,,,,,,,,http://libarchstor2.uah.edu/digitalcollections/files/original/42/4816/spc_bens_000051_000051.pdf,,"John Bensko, Jr. Collection",1,0
4817,http://libarchstor2.uah.edu/digitalcollections/items/show/4817,spc_bens_000052_000052,"Photo of a lunar drill part.",18891,"This photograph shows a separate part that makes up the lunar drill.","Bensko, John, Jr.",,1969,1960-1969,,,"Apollo Lunar Surface Drill^^Lunar surface samples^^Research^^Huntsville (Ala.)^^Madison County (Ala.)","Photographs^^Still Image",,"John Bensko, Jr. Collection^^University of Alabama in Huntsville Archives, Special Collections, and Digital Initiatives, Huntsville, Alabama",,,,en,"This material may be protected under U. S. Copyright Law (Title 17, U.S. Code) which governs the making of photocopies or reproductions of copyrighted materials. You may use the digitized material for private study, scholarship, or research. Though the University of Alabama in Huntsville Archives and Special Collections has physical ownership of the material in its collections, in some cases we may not own the copyright to the material. It is the patron's obligation to determine and satisfy copyright restrictions when publishing or otherwise distributing materials found in our collections.",spc_bens_2021_05,,,,,,,,,,,,,,,,,,,,,,,,,,,,,,,,,,,,,,,,,,,,,,,,,,,,,,,,,,,,,,,,,,,,,,,,,,,,,,,http://libarchstor2.uah.edu/digitalcollections/files/original/42/4817/spc_bens_000052_000052.pdf,,"John Bensko, Jr. Collection",1,0
4818,http://libarchstor2.uah.edu/digitalcollections/items/show/4818,spc_bens_000053_000053,"Photo of a lunar drill part.",CP18823,"This photograph shows a separate part that makes up the lunar drill.","Bensko, John, Jr.",,1969,1960-1969,,,"Apollo Lunar Surface Drill^^Lunar surface samples^^Research^^Huntsville (Ala.)^^Madison County (Ala.)","Photographs^^Still Image",,"John Bensko, Jr. Collection^^University of Alabama in Huntsville Archives, Special Collections, and Digital Initiatives, Huntsville, Alabama",,,,en,"This material may be protected under U. S. Copyright Law (Title 17, U.S. Code) which governs the making of photocopies or reproductions of copyrighted materials. You may use the digitized material for private study, scholarship, or research. Though the University of Alabama in Huntsville Archives and Special Collections has physical ownership of the material in its collections, in some cases we may not own the copyright to the material. It is the patron's obligation to determine and satisfy copyright restrictions when publishing or otherwise distributing materials found in our collections.",spc_bens_2021_05,,,,,,,,,,,,,,,,,,,,,,,,,,,,,,,,,,,,,,,,,,,,,,,,,,,,,,,,,,,,,,,,,,,,,,,,,,,,,,,http://libarchstor2.uah.edu/digitalcollections/files/original/42/4818/spc_bens_000053_000053.pdf,,"John Bensko, Jr. Collection",1,0