﻿"Item Id","Item URI","Dublin Core:Identifier","Dublin Core:Title","Dublin Core:Alternative Title","Dublin Core:Description","Dublin Core:Creator","Dublin Core:Publisher","Dublin Core:Date","Dublin Core:Temporal Coverage","Dublin Core:Coverage","Dublin Core:Spatial Coverage","Dublin Core:Subject","Dublin Core:Type","Dublin Core:Format","Dublin Core:Source","Dublin Core:Is Part Of","Dublin Core:Has Format","Dublin Core:Provenance","Dublin Core:Language","Dublin Core:Rights","Dublin Core:Relation","Dublin Core:Contributor","Dublin Core:Abstract","Dublin Core:Table Of Contents","Dublin Core:Date Available","Dublin Core:Date Created","Dublin Core:Date Accepted","Dublin Core:Date Copyrighted","Dublin Core:Date Submitted","Dublin Core:Date Issued","Dublin Core:Date Modified","Dublin Core:Date Valid","Dublin Core:Access Rights","Dublin Core:License","Dublin Core:Conforms To","Dublin Core:Has Part","Dublin Core:Has Version","Dublin Core:Is Format Of","Dublin Core:Is Referenced By","Dublin Core:Is Replaced By","Dublin Core:Is Required By","Dublin Core:Is Version Of","Dublin Core:References","Dublin Core:Replaces","Dublin Core:Requires","Dublin Core:Extent","Dublin Core:Medium","Dublin Core:Bibliographic Citation","Dublin Core:Accrual Method","Dublin Core:Accrual Periodicity","Dublin Core:Accrual Policy","Dublin Core:Audience","Dublin Core:Audience Education Level","Dublin Core:Mediator","Dublin Core:Instructional Method","Dublin Core:Rights Holder","Item Type Metadata:Text","Item Type Metadata:Interviewer","Item Type Metadata:Interviewee","Item Type Metadata:Location","Item Type Metadata:Transcription","Item Type Metadata:Local URL","Item Type Metadata:Original Format","Item Type Metadata:Physical Dimensions","Item Type Metadata:Duration","Item Type Metadata:Compression","Item Type Metadata:Producer","Item Type Metadata:Director","Item Type Metadata:Bit Rate/Frequency","Item Type Metadata:Time Summary","Item Type Metadata:Email Body","Item Type Metadata:Subject Line","Item Type Metadata:From","Item Type Metadata:To","Item Type Metadata:CC","Item Type Metadata:BCC","Item Type Metadata:Number of Attachments","Item Type Metadata:Standards","Item Type Metadata:Objectives","Item Type Metadata:Materials","Item Type Metadata:Lesson Plan Text","Item Type Metadata:URL","Item Type Metadata:Event Type","Item Type Metadata:Participants","Item Type Metadata:Birth Date","Item Type Metadata:Birthplace","Item Type Metadata:Death Date","Item Type Metadata:Occupation","Item Type Metadata:Biographical Text","Item Type Metadata:Bibliography","Item Type Metadata:Player","Item Type Metadata:Imported Thumbnail","Item Type Metadata:OHMS Object","Item Type Metadata:OHMS Object Text","Item Type Metadata:Interview Keyword","Item Type Metadata:Sort Priority","PDF Text:Text",Scripto:Transcription,tags,file,itemType,collection,public,featured
7872,http://libarchstor2.uah.edu/digitalcollections/items/show/7872,r02h04-01,"Old Photos of Cabaniss Connections",,,,,,1870-1879^^1880-1889^^1930-1939,,,"Cabaniss family^^Family^^Nineteenth century^^Photographs",Photographs,,"Frances Cabaniss Roberts Collection^^Series 2, Subseries H, Box 4, Folder 1^^University of Alabama in Huntsville Archives, Special Collections, and Digital Initiatives, Huntsville, Alabama",,,,en,"This material may be protected under U. S. Copyright Law (Title 17, U.S. Code) which governs the making of photocopies or reproductions of copyrighted materials. You may use the digitized material for private study, scholarship, or research. Though the University of Alabama in Huntsville Archives and Special Collections has physical ownership of the material in its collections, in some cases we may not own the copyright to the material. It is the patron's obligation to determine and satisfy copyright restrictions when publishing or otherwise distributing materials found in our collections.",r02h-210915,,,,,,,,,,,,,,,,,,,,,,,,,,,,,,,,,,,,,,,,,,,,,,,,,,,,,,,,,,,,,,,,,,,,,,,,,,,,,,,http://dkdayton.net/roberts/images/r02h/pdfs/r02h04-01.pdf,"Still Image","Series 02, Subseries H: Mementos, photos, and cards",1,0
7881,http://libarchstor2.uah.edu/digitalcollections/items/show/7881,r02h01-07,"Huntsville Photos by Students",,,"Aycock, Alfred Price^^Gardiner, Leland M., Jr.^^Shenk, William",,,,,,"Alabama–History–Huntsville, Madison County^^Historic sites–Huntsville, Madison County^^Nineteenth century^^Photographs^^Twentieth century",Photographs,,"Frances Cabaniss Roberts Collection^^Series 2, Subseries H, Box 1, Folder 7^^University of Alabama in Huntsville Archives, Special Collections, and Digital Initiatives, Huntsville, Alabama",,,,en,"This material may be protected under U. S. Copyright Law (Title 17, U.S. Code) which governs the making of photocopies or reproductions of copyrighted materials. You may use the digitized material for private study, scholarship, or research. Though the University of Alabama in Huntsville Archives and Special Collections has physical ownership of the material in its collections, in some cases we may not own the copyright to the material. It is the patron's obligation to determine and satisfy copyright restrictions when publishing or otherwise distributing materials found in our collections.",r02h-210915,,,,,,,,,,,,,,,,,,,,,,,,,,,,,,,,,,,,,,,,,,,,,,,,,,,,,,,,,,,,,,,,,,,,,,,,,,,,,,,http://dkdayton.net/roberts/images/r02h/pdfs/r02h01-07.pdf,"Still Image","Series 02, Subseries H: Mementos, photos, and cards",1,0
7900,http://libarchstor2.uah.edu/digitalcollections/items/show/7900,r04a23-16,"Cincinnati Historical Society Copies of Letters by Frank J. Jones from Huntsville, circa 1863",,,,,1863,1860-1869,,,"Correspondence, reminiscences, etc.^^Nineteenth century^^The National Union Catalog of Manuscript Collections^^United States–History–Civil War, 1861-1865",Documents,,"Frances Cabaniss Roberts Collection^^Series 4, Subseries A, Box 23, Folder 16^^University of Alabama in Huntsville Archives, Special Collections, and Digital Initiatives, Huntsville, Alabama",,,,en,"This material may be protected under U. S. Copyright Law (Title 17, U.S. Code) which governs the making of photocopies or reproductions of copyrighted materials. You may use the digitized material for private study, scholarship, or research. Though the University of Alabama in Huntsville Archives and Special Collections has physical ownership of the material in its collections, in some cases we may not own the copyright to the material. It is the patron's obligation to determine and satisfy copyright restrictions when publishing or otherwise distributing materials found in our collections.",r04a-210924,,,,,,,,,,,,,,,,,,,,,,,,,,,,,,,,,,,,,,,,,,,,,,,,,,,,,,,,,,,,,,,,,,,,,,,,,,,,,,,http://dkdayton.net/roberts/images/r04a/pdfs/r04a23-16.pdf,"Still Image","Series 04, Subseries A: Huntsville History",1,0
7901,http://libarchstor2.uah.edu/digitalcollections/items/show/7901,r04a23-15,"Miscellaneous records, Cabannis, 1814? - 1914",,,,,,,,,"Alabama–History–Madison County^^Cabaniss family^^County commissioner^^Courts^^History–Sources^^Nineteenth century^^Twentieth century",Documents,,"Frances Cabaniss Roberts Collection^^Series 4, Subseries A, Box 23, Folder 15^^University of Alabama in Huntsville Archives, Special Collections, and Digital Initiatives, Huntsville, Alabama",,,,en,"This material may be protected under U. S. Copyright Law (Title 17, U.S. Code) which governs the making of photocopies or reproductions of copyrighted materials. You may use the digitized material for private study, scholarship, or research. Though the University of Alabama in Huntsville Archives and Special Collections has physical ownership of the material in its collections, in some cases we may not own the copyright to the material. It is the patron's obligation to determine and satisfy copyright restrictions when publishing or otherwise distributing materials found in our collections.",r04a-210924,,,,,,,,,,,,,,,,,,,,,,,,,,,,,,,,,,,,,,,,,,,,,,,,,,,,,,,,,,,,,,,,,,,,,,,,,,,,,,,http://dkdayton.net/roberts/images/r04a/pdfs/r04a23-15.pdf,"Still Image","Series 04, Subseries A: Huntsville History",1,0
7902,http://libarchstor2.uah.edu/digitalcollections/items/show/7902,r04a23-14,"Huntsville City Code",,,"Hundley, Oscar R.",,1891,1890-1899,,,"Alabama–History–Huntsville, Madison County^^Charters^^City code^^Nineteenth century^^Ordinances",Pamphlets,,"Frances Cabaniss Roberts Collection^^Series 4, Subseries A, Box 23, Folder 14^^University of Alabama in Huntsville Archives, Special Collections, and Digital Initiatives, Huntsville, Alabama",,,,en,"This material may be protected under U. S. Copyright Law (Title 17, U.S. Code) which governs the making of photocopies or reproductions of copyrighted materials. You may use the digitized material for private study, scholarship, or research. Though the University of Alabama in Huntsville Archives and Special Collections has physical ownership of the material in its collections, in some cases we may not own the copyright to the material. It is the patron's obligation to determine and satisfy copyright restrictions when publishing or otherwise distributing materials found in our collections.",r04a-210924,,,,,,,,,,,,,,,,,,,,,,,,,,,,,,,,,,,,,,,,,,,,,,,,,,,,,,,,,,,,,,,,,,,,,,,,,,,,,,,http://dkdayton.net/roberts/images/r04a/pdfs/r04a23-14.pdf,"Still Image","Series 04, Subseries A: Huntsville History",1,0
7904,http://libarchstor2.uah.edu/digitalcollections/items/show/7904,r04a23-12,"Weekly Mercury Newspaper, 1896",,,,,1896-07-08,1890-1899,,,"Alabama–History–Huntsville, Madison County^^Newspapers^^Nineteenth century^^The Weekly Mercury",Newspapers,,"Frances Cabaniss Roberts Collection^^Series 4, Subseries A, Box 23, Folder 12^^University of Alabama in Huntsville Archives, Special Collections, and Digital Initiatives, Huntsville, Alabama",,,,en,"This material may be protected under U. S. Copyright Law (Title 17, U.S. Code) which governs the making of photocopies or reproductions of copyrighted materials. You may use the digitized material for private study, scholarship, or research. Though the University of Alabama in Huntsville Archives and Special Collections has physical ownership of the material in its collections, in some cases we may not own the copyright to the material. It is the patron's obligation to determine and satisfy copyright restrictions when publishing or otherwise distributing materials found in our collections.",r04a-210924,,,,,,,,,,,,,,,,,,,,,,,,,,,,,,,,,,,,,,,,,,,,,,,,,,,,,,,,,,,,,,,,,,,,,,,,,,,,,,,http://dkdayton.net/roberts/images/r04a/pdfs/r04a23-12.pdf,"Still Image","Series 04, Subseries A: Huntsville History",1,0
7906,http://libarchstor2.uah.edu/digitalcollections/items/show/7906,r04a23-10,"Taylor History of Madison County (handwritten)",,,,,,,,,"Alabama–History–Madison County^^Biography^^Books^^History–Sources^^Mississippi Territory^^Nineteenth century^^Writing",Books,,"Frances Cabaniss Roberts Collection^^Series 4, Subseries A, Box 23, Folder 10^^University of Alabama in Huntsville Archives, Special Collections, and Digital Initiatives, Huntsville, Alabama",,,,en,"This material may be protected under U. S. Copyright Law (Title 17, U.S. Code) which governs the making of photocopies or reproductions of copyrighted materials. You may use the digitized material for private study, scholarship, or research. Though the University of Alabama in Huntsville Archives and Special Collections has physical ownership of the material in its collections, in some cases we may not own the copyright to the material. It is the patron's obligation to determine and satisfy copyright restrictions when publishing or otherwise distributing materials found in our collections.",r04a-210924,,,,,,,,,,,,,,,,,,,,,,,,,,,,,,,,,,,,,,,,,,,,,,,,,,,,,,,,,,,,,,,,,,,,,,,,,,,,,,,http://dkdayton.net/roberts/images/r04a/pdfs/r04a23-10.pdf,"Still Image","Series 04, Subseries A: Huntsville History",1,0
7908,http://libarchstor2.uah.edu/digitalcollections/items/show/7908,r04a23-08,"Newspapers List, 1812 - 1969",,,,,,,,,"Alabama–History–Madison County^^Lists^^Newspapers^^Nineteenth century^^Twentieth century",Lists,,"Frances Cabaniss Roberts Collection^^Series 4, Subseries A, Box 23, Folder 8^^University of Alabama in Huntsville Archives, Special Collections, and Digital Initiatives, Huntsville, Alabama",,,,en,"This material may be protected under U. S. Copyright Law (Title 17, U.S. Code) which governs the making of photocopies or reproductions of copyrighted materials. You may use the digitized material for private study, scholarship, or research. Though the University of Alabama in Huntsville Archives and Special Collections has physical ownership of the material in its collections, in some cases we may not own the copyright to the material. It is the patron's obligation to determine and satisfy copyright restrictions when publishing or otherwise distributing materials found in our collections.",r04a-210924,,,,,,,,,,,,,,,,,,,,,,,,,,,,,,,,,,,,,,,,,,,,,,,,,,,,,,,,,,,,,,,,,,,,,,,,,,,,,,,http://dkdayton.net/roberts/images/r04a/pdfs/r04a23-08.pdf,"Still Image","Series 04, Subseries A: Huntsville History",1,0
7911,http://libarchstor2.uah.edu/digitalcollections/items/show/7911,r04a23-05,"Mississippi Territory Papers - copies, 1813",,,,,,1800-1809^^1810-1819,,,"Alabama–History–Madison County^^Mississippi Territory^^Nineteenth century^^United States–History–Frontier",Documents,,"Frances Cabaniss Roberts Collection^^Series 4, Subseries A, Box 23, Folder 5^^University of Alabama in Huntsville Archives, Special Collections, and Digital Initiatives, Huntsville, Alabama",,,,en,"This material may be protected under U. S. Copyright Law (Title 17, U.S. Code) which governs the making of photocopies or reproductions of copyrighted materials. You may use the digitized material for private study, scholarship, or research. Though the University of Alabama in Huntsville Archives and Special Collections has physical ownership of the material in its collections, in some cases we may not own the copyright to the material. It is the patron's obligation to determine and satisfy copyright restrictions when publishing or otherwise distributing materials found in our collections.",r04a-210924,,,,,,,,,,,,,,,,,,,,,,,,,,,,,,,,,,,,,,,,,,,,,,,,,,,,,,,,,,,,,,,,,,,,,,,,,,,,,,,http://dkdayton.net/roberts/images/r04a/pdfs/r04a23-05.pdf,"Still Image","Series 04, Subseries A: Huntsville History",1,0
7915,http://libarchstor2.uah.edu/digitalcollections/items/show/7915,r04a23-01,"Rowe Pocket (1855) Diary - copy, 1855 - 1856",,,,,1855,1850-1859,,,"Diaries^^History^^History–Sources^^Nineteenth century^^Pocket, Rowe",Diaries,,"Frances Cabaniss Roberts Collection^^Series 4, Subseries A, Box 23, Folder 1^^University of Alabama in Huntsville Archives, Special Collections, and Digital Initiatives, Huntsville, Alabama",,,,en,"This material may be protected under U. S. Copyright Law (Title 17, U.S. Code) which governs the making of photocopies or reproductions of copyrighted materials. You may use the digitized material for private study, scholarship, or research. Though the University of Alabama in Huntsville Archives and Special Collections has physical ownership of the material in its collections, in some cases we may not own the copyright to the material. It is the patron's obligation to determine and satisfy copyright restrictions when publishing or otherwise distributing materials found in our collections.",r04a-210924,,,,,,,,,,,,,,,,,,,,,,,,,,,,,,,,,,,,,,,,,,,,,,,,,,,,,,,,,,,,,,,,,,,,,,,,,,,,,,,http://dkdayton.net/roberts/images/r04a/pdfs/r04a23-01.pdf,"Still Image","Series 04, Subseries A: Huntsville History",1,0
7919,http://libarchstor2.uah.edu/digitalcollections/items/show/7919,r04a22-19,"Daily Mercury Newspaper, 1897",,,,,1897-11-25,1890-1899,,,"Alabama–History–Huntsville, Madison County^^Newspapers^^Nineteenth century^^The Daily Mercury",Newspapers,,"Frances Cabaniss Roberts Collection^^Series 4, Subseries A, Box 22, Folder 19^^University of Alabama in Huntsville Archives, Special Collections, and Digital Initiatives, Huntsville, Alabama",,,,en,"This material may be protected under U. S. Copyright Law (Title 17, U.S. Code) which governs the making of photocopies or reproductions of copyrighted materials. You may use the digitized material for private study, scholarship, or research. Though the University of Alabama in Huntsville Archives and Special Collections has physical ownership of the material in its collections, in some cases we may not own the copyright to the material. It is the patron's obligation to determine and satisfy copyright restrictions when publishing or otherwise distributing materials found in our collections.",r04a-210924,,,,,,,,,,,,,,,,,,,,,,,,,,,,,,,,,,,,,,,,,,,,,,,,,,,,,,,,,,,,,,,,,,,,,,,,,,,,,,,http://dkdayton.net/roberts/images/r04a/pdfs/r04a22-19.pdf,"Still Image","Series 04, Subseries A: Huntsville History",1,0
7923,http://libarchstor2.uah.edu/digitalcollections/items/show/7923,r04a22-15,"Deaths and Murders in Local Newspapers, 1880 -1966",,,,,,1880-1889^^1900-1909^^1920-1929^^1950-1959^^1960-1969,,,"Alabama–History–Huntsville, Madison County^^Death^^Murder^^Newspapers^^Nineteenth century^^Twentieth century",Newspapers,,"Frances Cabaniss Roberts Collection^^Series 4, Subseries A, Box 22, Folder 15^^University of Alabama in Huntsville Archives, Special Collections, and Digital Initiatives, Huntsville, Alabama",,,,en,"This material may be protected under U. S. Copyright Law (Title 17, U.S. Code) which governs the making of photocopies or reproductions of copyrighted materials. You may use the digitized material for private study, scholarship, or research. Though the University of Alabama in Huntsville Archives and Special Collections has physical ownership of the material in its collections, in some cases we may not own the copyright to the material. It is the patron's obligation to determine and satisfy copyright restrictions when publishing or otherwise distributing materials found in our collections.",r04a-210924,,,,,,,,,,,,,,,,,,,,,,,,,,,,,,,,,,,,,,,,,,,,,,,,,,,,,,,,,,,,,,,,,,,,,,,,,,,,,,,http://dkdayton.net/roberts/images/r04a/pdfs/r04a22-15.pdf,"Still Image","Series 04, Subseries A: Huntsville History",1,0
7924,http://libarchstor2.uah.edu/digitalcollections/items/show/7924,r04a22-14,"Madison County Politics, 1811 - 1955",,,,,,1870-1879^^1880-1889^^1920-1929^^1930-1939^^1940-1949^^1950-1959,,,"Alabama–History–Madison County^^Nineteenth century^^Politics^^Rather, John Daniel^^The Huntsville Weekly Democrat^^Twentieth century",Essays^^Newspapers,,"Frances Cabaniss Roberts Collection^^Series 4, Subseries A, Box 22, Folder 14^^University of Alabama in Huntsville Archives, Special Collections, and Digital Initiatives, Huntsville, Alabama",,,,en,"This material may be protected under U. S. Copyright Law (Title 17, U.S. Code) which governs the making of photocopies or reproductions of copyrighted materials. You may use the digitized material for private study, scholarship, or research. Though the University of Alabama in Huntsville Archives and Special Collections has physical ownership of the material in its collections, in some cases we may not own the copyright to the material. It is the patron's obligation to determine and satisfy copyright restrictions when publishing or otherwise distributing materials found in our collections.",r04a-210924,,,,,,,,,,,,,,,,,,,,,,,,,,,,,,,,,,,,,,,,,,,,,,,,,,,,,,,,,,,,,,,,,,,,,,,,,,,,,,,http://dkdayton.net/roberts/images/r04a/pdfs/r04a22-14.pdf,"Still Image","Series 04, Subseries A: Huntsville History",1,0
7926,http://libarchstor2.uah.edu/digitalcollections/items/show/7926,r04a22-12,"Madison County Land Applications and Tax Collection, 1805 - 1817",,,,,1805^^1809^^1817,1800-1809^^1810-1819,,,"Alabama–History–Madison County^^Nineteenth century^^Public land sales^^Taxes^^United States. Federal Land Office",Charts,,"Frances Cabaniss Roberts Collection^^Series 4, Subseries A, Box 22, Folder 12^^University of Alabama in Huntsville Archives, Special Collections, and Digital Initiatives, Huntsville, Alabama",,,,en,"This material may be protected under U. S. Copyright Law (Title 17, U.S. Code) which governs the making of photocopies or reproductions of copyrighted materials. You may use the digitized material for private study, scholarship, or research. Though the University of Alabama in Huntsville Archives and Special Collections has physical ownership of the material in its collections, in some cases we may not own the copyright to the material. It is the patron's obligation to determine and satisfy copyright restrictions when publishing or otherwise distributing materials found in our collections.",r04a-210924,,,,,,,,,,,,,,,,,,,,,,,,,,,,,,,,,,,,,,,,,,,,,,,,,,,,,,,,,,,,,,,,,,,,,,,,,,,,,,,http://dkdayton.net/roberts/images/r04a/pdfs/r04a22-12.pdf,"Still Image","Series 04, Subseries A: Huntsville History",1,0
7955,http://libarchstor2.uah.edu/digitalcollections/items/show/7955,r04a19-12,"Huntsville Newspaper Notes, 1811 - 1828",,,,,,1810-1819^^1820-1829,,,"Alabama–History–Huntsville, Madison County^^History–Research^^Newspapers^^Notes (Cataloging)^^Nineteenth century",Clippings^^Notes,,"Frances Cabaniss Roberts Collection^^Series 4, Subseries A, Box 19, Folder 12^^University of Alabama in Huntsville Archives, Special Collections, and Digital Initiatives, Huntsville, Alabama",,,,en,"This material may be protected under U. S. Copyright Law (Title 17, U.S. Code) which governs the making of photocopies or reproductions of copyrighted materials. You may use the digitized material for private study, scholarship, or research. Though the University of Alabama in Huntsville Archives and Special Collections has physical ownership of the material in its collections, in some cases we may not own the copyright to the material. It is the patron's obligation to determine and satisfy copyright restrictions when publishing or otherwise distributing materials found in our collections.",r04a-210924,,,,,,,,,,,,,,,,,,,,,,,,,,,,,,,,,,,,,,,,,,,,,,,,,,,,,,,,,,,,,,,,,,,,,,,,,,,,,,,http://dkdayton.net/roberts/images/r04a/pdfs/r04a19-12.pdf,"Still Image","Series 04, Subseries A: Huntsville History",1,0
7963,http://libarchstor2.uah.edu/digitalcollections/items/show/7963,r04a19-04,"Newspaper Excerpts from Alabama Republican (reprints), President Monroe tour, Huntsville Female Education Society, 1819 -1833",,,,,1818^^1819^^1820^^1833,1810-1819^^1820-1829^^1830-1839,,,"Alabama Historical Society^^Alabama–History–Huntsville, Madison County^^History–Sources^^Huntsville Female Education Society (Ala.)^^Monroe, James, 1758-1831^^Nineteenth century",Clippings,,"Frances Cabaniss Roberts Collection^^Series 4, Subseries A, Box 19, Folder 4^^University of Alabama in Huntsville Archives, Special Collections, and Digital Initiatives, Huntsville, Alabama",,,,en,"This material may be protected under U. S. Copyright Law (Title 17, U.S. Code) which governs the making of photocopies or reproductions of copyrighted materials. You may use the digitized material for private study, scholarship, or research. Though the University of Alabama in Huntsville Archives and Special Collections has physical ownership of the material in its collections, in some cases we may not own the copyright to the material. It is the patron's obligation to determine and satisfy copyright restrictions when publishing or otherwise distributing materials found in our collections.",r04a-210924,,,,,,,,,,,,,,,,,,,,,,,,,,,,,,,,,,,,,,,,,,,,,,,,,,,,,,,,,,,,,,,,,,,,,,,,,,,,,,,http://dkdayton.net/roberts/images/r04a/pdfs/r04a19-04.pdf,"Still Image","Series 04, Subseries A: Huntsville History",1,0