﻿"Item Id","Item URI","Dublin Core:Identifier","Dublin Core:Title","Dublin Core:Alternative Title","Dublin Core:Description","Dublin Core:Creator","Dublin Core:Publisher","Dublin Core:Date","Dublin Core:Temporal Coverage","Dublin Core:Coverage","Dublin Core:Spatial Coverage","Dublin Core:Subject","Dublin Core:Type","Dublin Core:Format","Dublin Core:Source","Dublin Core:Is Part Of","Dublin Core:Has Format","Dublin Core:Provenance","Dublin Core:Language","Dublin Core:Rights","Dublin Core:Relation","Dublin Core:Contributor","Dublin Core:Abstract","Dublin Core:Table Of Contents","Dublin Core:Date Available","Dublin Core:Date Created","Dublin Core:Date Accepted","Dublin Core:Date Copyrighted","Dublin Core:Date Submitted","Dublin Core:Date Issued","Dublin Core:Date Modified","Dublin Core:Date Valid","Dublin Core:Access Rights","Dublin Core:License","Dublin Core:Conforms To","Dublin Core:Has Part","Dublin Core:Has Version","Dublin Core:Is Format Of","Dublin Core:Is Referenced By","Dublin Core:Is Replaced By","Dublin Core:Is Required By","Dublin Core:Is Version Of","Dublin Core:References","Dublin Core:Replaces","Dublin Core:Requires","Dublin Core:Extent","Dublin Core:Medium","Dublin Core:Bibliographic Citation","Dublin Core:Accrual Method","Dublin Core:Accrual Periodicity","Dublin Core:Accrual Policy","Dublin Core:Audience","Dublin Core:Audience Education Level","Dublin Core:Mediator","Dublin Core:Instructional Method","Dublin Core:Rights Holder","Item Type Metadata:Text","Item Type Metadata:Interviewer","Item Type Metadata:Interviewee","Item Type Metadata:Location","Item Type Metadata:Transcription","Item Type Metadata:Local URL","Item Type Metadata:Original Format","Item Type Metadata:Physical Dimensions","Item Type Metadata:Duration","Item Type Metadata:Compression","Item Type Metadata:Producer","Item Type Metadata:Director","Item Type Metadata:Bit Rate/Frequency","Item Type Metadata:Time Summary","Item Type Metadata:Email Body","Item Type Metadata:Subject Line","Item Type Metadata:From","Item Type Metadata:To","Item Type Metadata:CC","Item Type Metadata:BCC","Item Type Metadata:Number of Attachments","Item Type Metadata:Standards","Item Type Metadata:Objectives","Item Type Metadata:Materials","Item Type Metadata:Lesson Plan Text","Item Type Metadata:URL","Item Type Metadata:Event Type","Item Type Metadata:Participants","Item Type Metadata:Birth Date","Item Type Metadata:Birthplace","Item Type Metadata:Death Date","Item Type Metadata:Occupation","Item Type Metadata:Biographical Text","Item Type Metadata:Bibliography","Item Type Metadata:Player","Item Type Metadata:Imported Thumbnail","Item Type Metadata:OHMS Object","Item Type Metadata:OHMS Object Text","Item Type Metadata:Interview Keyword","Item Type Metadata:Sort Priority","PDF Text:Text",Scripto:Transcription,tags,file,itemType,collection,public,featured
1049,http://libarchstor2.uah.edu/digitalcollections/items/show/1049,uah_uahp_000397,"UAH students enjoy the 2001 Homecoming bonfire.",,,"University of Alabama in Huntsville",,2001-02-01,2000-2009,,,"College students^^Greek letter societies^^Student activities^^University of Alabama in Huntsville^^Huntsville (Ala.)^^Madison County (Ala.)","Photographs^^Still Image",Slides,"UAH Photograph Collection^^University of Alabama in Huntsville Archives, Special Collections, and Digital Initiatives, Huntsville, Alabama",,,,en,"This material may be protected under U. S. Copyright Law (Title 17, U.S. Code) which governs the making of photocopies or reproductions of copyrighted materials. You may use the digitized material for private study, scholarship, or research. Though the University of Alabama in Huntsville Archives and Special Collections has physical ownership of the material in its collections, in some cases we may not own the copyright to the material. It is the patron's obligation to determine and satisfy copyright restrictions when publishing or otherwise distributing materials found in our collections.",uah_photos_2019_10,,,,,,,,,,,,,,,,,,,,,,,,,,,,,,,,,,,,,,,,,,,,,,,,,,,,,,,,,,,,,,,,,,,,,,,,,,,,,,,http://libarchstor2.uah.edu/digitalcollections/files/original/40/1049/uah_uahp_000397.pdf,,"UAH Photograph Collection",1,0
829,http://libarchstor2.uah.edu/digitalcollections/items/show/829,uah_uahp_000274,"UAH students gather on the front steps of Morton Hall.",,,"University of Alabama in Huntsville",,,,,,"College buildings^^College students^^University of Alabama in Huntsville^^Huntsville (Ala.)^^Madison County (Ala.)","Photographs^^Still Image",,"UAH Photograph Collection^^University of Alabama in Huntsville Archives, Special Collections, and Digital Initiatives, Huntsville, Alabama",,,,en,"This material may be protected under U. S. Copyright Law (Title 17, U.S. Code) which governs the making of photocopies or reproductions of copyrighted materials. You may use the digitized material for private study, scholarship, or research. Though the University of Alabama in Huntsville Archives and Special Collections has physical ownership of the material in its collections, in some cases we may not own the copyright to the material. It is the patron's obligation to determine and satisfy copyright restrictions when publishing or otherwise distributing materials found in our collections.",uah_photos_2019_05,,,,,,,,,,,,,,,,,,,,,,,,,,,,,,,,,,,,,,,,,,,,,,,,,,,,,,,,,,,,,,,,,,,,,,,,,,,,,,,http://libarchstor2.uah.edu/digitalcollections/files/original/40/829/uah_uahp_000274_web.pdf,,"UAH Photograph Collection",1,0
848,http://libarchstor2.uah.edu/digitalcollections/items/show/848,uah_uahp_000293,"UAH students give a presentation in class.",,"Shown at far left, Don Blaise, and at far right, Joe Fitzgerald.","University of Alabama in Huntsville",,,,,,"College students^^University of Alabama in Huntsville^^Huntsville (Ala.)^^Madison County (Ala.)","Photographs^^Still Image",,"UAH Photograph Collection^^University of Alabama in Huntsville Archives, Special Collections, and Digital Initiatives, Huntsville, Alabama",,,,en,"This material may be protected under U. S. Copyright Law (Title 17, U.S. Code) which governs the making of photocopies or reproductions of copyrighted materials. You may use the digitized material for private study, scholarship, or research. Though the University of Alabama in Huntsville Archives and Special Collections has physical ownership of the material in its collections, in some cases we may not own the copyright to the material. It is the patron's obligation to determine and satisfy copyright restrictions when publishing or otherwise distributing materials found in our collections.",uah_photos_2019_05,,,,,,,,,,,,,,,,,,,,,,,,,,,,,,,,,,,,,,,,,,,,,,,,,,,,,,,,,,,,,,,,,,,,,,,,,,,,,,,http://libarchstor2.uah.edu/digitalcollections/files/original/40/848/uah_uahp_000293_web.pdf,,"UAH Photograph Collection",1,0
645,http://libarchstor2.uah.edu/digitalcollections/items/show/645,uah_uahp_0000092,"UAH students playing tug of war.",,,"University of Alabama in Huntsville",,,,,,"College students^^Student activities^^University of Alabama in Huntsville^^Huntsville (Ala.)^^Madison County (Ala.)","Photographs^^Still Image",,"UAH Photograph Collection^^University of Alabama in Huntsville Archives, Special Collections, and Digital Initiatives, Huntsville, Alabama",,,,en,"This material may be protected under U. S. Copyright Law (Title 17, U.S. Code) which governs the making of photocopies or reproductions of copyrighted materials. You may use the digitized material for private study, scholarship, or research. Though the University of Alabama in Huntsville Archives and Special Collections has physical ownership of the material in its collections, in some cases we may not own the copyright to the material. It is the patron's obligation to determine and satisfy copyright restrictions when publishing or otherwise distributing materials found in our collections.",uah_uahp_2019_04,,,,,,,,,,,,,,,,,,,,,,,,,,,,,,,,,,,,,,,,,,,,,,,,,,,,,,,,,,,,,,,,,,,,,,,,,,,,,,,http://libarchstor2.uah.edu/digitalcollections/files/original/40/645/uah_uahp_0000092_web.pdf,,"UAH Photograph Collection",1,0
847,http://libarchstor2.uah.edu/digitalcollections/items/show/847,uah_uahp_000292,"UAH students protest the draft in Wilson Hall.",,,"Wilson, Weldon",,1980-03-19,1980-1989,,,"College students^^Student activities^^University of Alabama in Huntsville^^Huntsville (Ala.)^^Madison County (Ala.)","Photographs^^Still Image",,"UAH Photograph Collection^^University of Alabama in Huntsville Archives, Special Collections, and Digital Initiatives, Huntsville, Alabama",,,,en,"This material may be protected under U. S. Copyright Law (Title 17, U.S. Code) which governs the making of photocopies or reproductions of copyrighted materials. You may use the digitized material for private study, scholarship, or research. Though the University of Alabama in Huntsville Archives and Special Collections has physical ownership of the material in its collections, in some cases we may not own the copyright to the material. It is the patron's obligation to determine and satisfy copyright restrictions when publishing or otherwise distributing materials found in our collections.",uah_photos_2019_05,,,,,,,,,,,,,,,,,,,,,,,,,,,,,,,,,,,,,,,,,,,,,,,,,,,,,,,,,,,,,,,,,,,,,,,,,,,,,,,http://libarchstor2.uah.edu/digitalcollections/files/original/40/847/uah_uahp_000292_web.pdf,,"UAH Photograph Collection",1,0
853,http://libarchstor2.uah.edu/digitalcollections/items/show/853,uah_uahp_000298,"University bookstore employees move inventory.",,,"University of Alabama in Huntsville",,1980-05,1980-1989,,,"College students^^University of Alabama in Huntsville^^Huntsville (Ala.)^^Madison County (Ala.)","Photographs^^Still Image",,"UAH Photograph Collection^^University of Alabama in Huntsville Archives, Special Collections, and Digital Initiatives, Huntsville, Alabama",,,,en,"This material may be protected under U. S. Copyright Law (Title 17, U.S. Code) which governs the making of photocopies or reproductions of copyrighted materials. You may use the digitized material for private study, scholarship, or research. Though the University of Alabama in Huntsville Archives and Special Collections has physical ownership of the material in its collections, in some cases we may not own the copyright to the material. It is the patron's obligation to determine and satisfy copyright restrictions when publishing or otherwise distributing materials found in our collections.",uah_photos_2019_05,,,,,,,,,,,,,,,,,,,,,,,,,,,,,,,,,,,,,,,,,,,,,,,,,,,,,,,,,,,,,,,,,,,,,,,,,,,,,,,http://libarchstor2.uah.edu/digitalcollections/files/original/40/853/uah_uahp_000298_web.pdf,,"UAH Photograph Collection",1,0
709,http://libarchstor2.uah.edu/digitalcollections/items/show/709,uah_uahp_000154,"View from the stage at 1970 commencement.",,,"University of Alabama in Huntsville",,1970-06-07,1970-1979,,,"Commencement ceremonies^^College campuses^^College students^^University of Alabama in Huntsville^^Huntsville (Ala.)^^Madison County (Ala.)","Photographs^^Still Image",,"UAH Photograph Collection^^University of Alabama in Huntsville Archives, Special Collections, and Digital Initiatives, Huntsville, Alabama",,,,en,"This material may be protected under U. S. Copyright Law (Title 17, U.S. Code) which governs the making of photocopies or reproductions of copyrighted materials. You may use the digitized material for private study, scholarship, or research. Though the University of Alabama in Huntsville Archives and Special Collections has physical ownership of the material in its collections, in some cases we may not own the copyright to the material. It is the patron's obligation to determine and satisfy copyright restrictions when publishing or otherwise distributing materials found in our collections.",uah_photos_2019_05,,,,,,,,,,,,,,,,,,,,,,,,,,,,,,,,,,,,,,,,,,,,,,,,,,,,,,,,,,,,,,,,,,,,,,,,,,,,,,,http://libarchstor2.uah.edu/digitalcollections/files/original/40/709/uah_uahp_000154_web.pdf,,"UAH Photograph Collection",1,0
763,http://libarchstor2.uah.edu/digitalcollections/items/show/763,uah_uahp_000208,"View of a dorm room interior at Southeast Campus Housing.",,"The complex was then known as University Housing.","University of Alabama in Huntsville",,,,,,"College buildings^^College campuses^^College students^^Student housing^^University of Alabama in Huntsville^^Huntsville (Ala.)^^Madison County (Ala.)","Photographs^^Still Image",,"UAH Photograph Collection^^University of Alabama in Huntsville Archives, Special Collections, and Digital Initiatives, Huntsville, Alabama",,,,en,"This material may be protected under U. S. Copyright Law (Title 17, U.S. Code) which governs the making of photocopies or reproductions of copyrighted materials. You may use the digitized material for private study, scholarship, or research. Though the University of Alabama in Huntsville Archives and Special Collections has physical ownership of the material in its collections, in some cases we may not own the copyright to the material. It is the patron's obligation to determine and satisfy copyright restrictions when publishing or otherwise distributing materials found in our collections.",uah_photos_2019_05,,,,,,,,,,,,,,,,,,,,,,,,,,,,,,,,,,,,,,,,,,,,,,,,,,,,,,,,,,,,,,,,,,,,,,,,,,,,,,,http://libarchstor2.uah.edu/digitalcollections/files/original/40/763/uah_uahp_000208_web.pdf,,"UAH Photograph Collection",1,0
841,http://libarchstor2.uah.edu/digitalcollections/items/show/841,uah_uahp_000286,"View of students at the University Center at UAH.",,,"University of Alabama in Huntsville",,,,,,"College students^^University of Alabama in Huntsville^^Huntsville (Ala.)^^Madison County (Ala.)","Photographs^^Still Image",,"UAH Photograph Collection^^University of Alabama in Huntsville Archives, Special Collections, and Digital Initiatives, Huntsville, Alabama",,,,en,"This material may be protected under U. S. Copyright Law (Title 17, U.S. Code) which governs the making of photocopies or reproductions of copyrighted materials. You may use the digitized material for private study, scholarship, or research. Though the University of Alabama in Huntsville Archives and Special Collections has physical ownership of the material in its collections, in some cases we may not own the copyright to the material. It is the patron's obligation to determine and satisfy copyright restrictions when publishing or otherwise distributing materials found in our collections.",uah_photos_2019_05,,,,,,,,,,,,,,,,,,,,,,,,,,,,,,,,,,,,,,,,,,,,,,,,,,,,,,,,,,,,,,,,,,,,,,,,,,,,,,,http://libarchstor2.uah.edu/digitalcollections/files/original/40/841/uah_uahp_000286_web.pdf,,"UAH Photograph Collection",1,0
717,http://libarchstor2.uah.edu/digitalcollections/items/show/717,uah_uahp_000162,"View of the class of 1970 at commencement.",,"Morton Hall can be seen in the background.","University of Alabama in Huntsville",,1970-06-07,1970-1979,,,"Commencement ceremonies^^College campuses^^College students^^University of Alabama in Huntsville^^Huntsville (Ala.)^^Madison County (Ala.)","Photographs^^Still Image",,"UAH Photograph Collection^^University of Alabama in Huntsville Archives, Special Collections, and Digital Initiatives, Huntsville, Alabama",,,,en,"This material may be protected under U. S. Copyright Law (Title 17, U.S. Code) which governs the making of photocopies or reproductions of copyrighted materials. You may use the digitized material for private study, scholarship, or research. Though the University of Alabama in Huntsville Archives and Special Collections has physical ownership of the material in its collections, in some cases we may not own the copyright to the material. It is the patron's obligation to determine and satisfy copyright restrictions when publishing or otherwise distributing materials found in our collections.",uah_photos_2019_05,,,,,,,,,,,,,,,,,,,,,,,,,,,,,,,,,,,,,,,,,,,,,,,,,,,,,,,,,,,,,,,,,,,,,,,,,,,,,,,http://libarchstor2.uah.edu/digitalcollections/files/original/40/717/uah_uahp_000162_web.pdf,,"UAH Photograph Collection",1,0
705,http://libarchstor2.uah.edu/digitalcollections/items/show/705,uah_uahp_000150,"View of the commencement stage during Eric Sevareid's speech.",,"Sevareid was a news journalist and war correspondent for CBS.","University of Alabama in Huntsville",,1970-06-07,1970-1979,,,"Sevareid, Eric, 1912-1992^^Commencement ceremonies^^College campuses^^College students^^University of Alabama in Huntsville^^Huntsville (Ala.)^^Madison County (Ala.)","Photographs^^Still Image",,"UAH Photograph Collection^^University of Alabama in Huntsville Archives, Special Collections, and Digital Initiatives, Huntsville, Alabama",,,,en,"This material may be protected under U. S. Copyright Law (Title 17, U.S. Code) which governs the making of photocopies or reproductions of copyrighted materials. You may use the digitized material for private study, scholarship, or research. Though the University of Alabama in Huntsville Archives and Special Collections has physical ownership of the material in its collections, in some cases we may not own the copyright to the material. It is the patron's obligation to determine and satisfy copyright restrictions when publishing or otherwise distributing materials found in our collections.",uah_photos_2019_05,,,,,,,,,,,,,,,,,,,,,,,,,,,,,,,,,,,,,,,,,,,,,,,,,,,,,,,,,,,,,,,,,,,,,,,,,,,,,,,http://libarchstor2.uah.edu/digitalcollections/files/original/40/705/uah_uahp_000150_web.pdf,,"UAH Photograph Collection",1,0
710,http://libarchstor2.uah.edu/digitalcollections/items/show/710,uah_uahp_000155,"View of the crowd and stage at 1970 commencement.",,"The UAH Library can be seen in the background.","University of Alabama in Huntsville",,1970-06-07,1970-1979,,,"Commencement ceremonies^^College campuses^^College students^^University of Alabama in Huntsville^^Huntsville (Ala.)^^Madison County (Ala.)","Photographs^^Still Image",,"UAH Photograph Collection^^University of Alabama in Huntsville Archives, Special Collections, and Digital Initiatives, Huntsville, Alabama",,,,en,"This material may be protected under U. S. Copyright Law (Title 17, U.S. Code) which governs the making of photocopies or reproductions of copyrighted materials. You may use the digitized material for private study, scholarship, or research. Though the University of Alabama in Huntsville Archives and Special Collections has physical ownership of the material in its collections, in some cases we may not own the copyright to the material. It is the patron's obligation to determine and satisfy copyright restrictions when publishing or otherwise distributing materials found in our collections.",uah_photos_2019_05,,,,,,,,,,,,,,,,,,,,,,,,,,,,,,,,,,,,,,,,,,,,,,,,,,,,,,,,,,,,,,,,,,,,,,,,,,,,,,,http://libarchstor2.uah.edu/digitalcollections/files/original/40/710/uah_uahp_000155_web.pdf,,"UAH Photograph Collection",1,0
711,http://libarchstor2.uah.edu/digitalcollections/items/show/711,uah_uahp_000156,"View of the crowd and stage at 1970 commencement.",,"The UAH Library can be seen in the background.","University of Alabama in Huntsville",,1970-06-07,1970-1979,,,"Commencement ceremonies^^College campuses^^College students^^University of Alabama in Huntsville^^Huntsville (Ala.)^^Madison County (Ala.)","Photographs^^Still Image",,"UAH Photograph Collection^^University of Alabama in Huntsville Archives, Special Collections, and Digital Initiatives, Huntsville, Alabama",,,,en,"This material may be protected under U. S. Copyright Law (Title 17, U.S. Code) which governs the making of photocopies or reproductions of copyrighted materials. You may use the digitized material for private study, scholarship, or research. Though the University of Alabama in Huntsville Archives and Special Collections has physical ownership of the material in its collections, in some cases we may not own the copyright to the material. It is the patron's obligation to determine and satisfy copyright restrictions when publishing or otherwise distributing materials found in our collections.",uah_photos_2019_05,,,,,,,,,,,,,,,,,,,,,,,,,,,,,,,,,,,,,,,,,,,,,,,,,,,,,,,,,,,,,,,,,,,,,,,,,,,,,,,http://libarchstor2.uah.edu/digitalcollections/files/original/40/711/uah_uahp_000156_web.pdf,,"UAH Photograph Collection",1,0
727,http://libarchstor2.uah.edu/digitalcollections/items/show/727,uah_uahp_000172,"View of the crowd and stage at 1970 commencement.",,"The library can be seen in the background.","University of Alabama in Huntsville",,1970-06-07,1970-1979,,,"Commencement ceremonies^^College campuses^^College students^^University of Alabama in Huntsville^^Huntsville (Ala.)^^Madison County (Ala.)","Photographs^^Still Image",,"UAH Photograph Collection^^University of Alabama in Huntsville Archives, Special Collections, and Digital Initiatives, Huntsville, Alabama",,,,en,"This material may be protected under U. S. Copyright Law (Title 17, U.S. Code) which governs the making of photocopies or reproductions of copyrighted materials. You may use the digitized material for private study, scholarship, or research. Though the University of Alabama in Huntsville Archives and Special Collections has physical ownership of the material in its collections, in some cases we may not own the copyright to the material. It is the patron's obligation to determine and satisfy copyright restrictions when publishing or otherwise distributing materials found in our collections.",uah_photos_2019_05,,,,,,,,,,,,,,,,,,,,,,,,,,,,,,,,,,,,,,,,,,,,,,,,,,,,,,,,,,,,,,,,,,,,,,,,,,,,,,,http://libarchstor2.uah.edu/digitalcollections/files/original/40/727/uah_uahp_000172_web.pdf,,"UAH Photograph Collection",1,0
708,http://libarchstor2.uah.edu/digitalcollections/items/show/708,uah_uahp_000153,"View of the crowd and the class of 1970 at commencement.",,"Morton Hall can be seen in the background.","University of Alabama in Huntsville",,1970-06-07,1970-1979,,,"Commencement ceremonies^^College campuses^^College students^^University of Alabama in Huntsville^^Huntsville (Ala.)^^Madison County (Ala.)","Photographs^^Still Image",,"UAH Photograph Collection^^University of Alabama in Huntsville Archives, Special Collections, and Digital Initiatives, Huntsville, Alabama",,,,en,"This material may be protected under U. S. Copyright Law (Title 17, U.S. Code) which governs the making of photocopies or reproductions of copyrighted materials. You may use the digitized material for private study, scholarship, or research. Though the University of Alabama in Huntsville Archives and Special Collections has physical ownership of the material in its collections, in some cases we may not own the copyright to the material. It is the patron's obligation to determine and satisfy copyright restrictions when publishing or otherwise distributing materials found in our collections.",uah_photos_2019_05,,,,,,,,,,,,,,,,,,,,,,,,,,,,,,,,,,,,,,,,,,,,,,,,,,,,,,,,,,,,,,,,,,,,,,,,,,,,,,,http://libarchstor2.uah.edu/digitalcollections/files/original/40/708/uah_uahp_000153_web.pdf,,"UAH Photograph Collection",1,0