﻿"Item Id","Item URI","Dublin Core:Identifier","Dublin Core:Title","Dublin Core:Alternative Title","Dublin Core:Description","Dublin Core:Creator","Dublin Core:Publisher","Dublin Core:Date","Dublin Core:Temporal Coverage","Dublin Core:Coverage","Dublin Core:Spatial Coverage","Dublin Core:Subject","Dublin Core:Type","Dublin Core:Format","Dublin Core:Source","Dublin Core:Is Part Of","Dublin Core:Has Format","Dublin Core:Provenance","Dublin Core:Language","Dublin Core:Rights","Dublin Core:Relation","Dublin Core:Contributor","Dublin Core:Abstract","Dublin Core:Table Of Contents","Dublin Core:Date Available","Dublin Core:Date Created","Dublin Core:Date Accepted","Dublin Core:Date Copyrighted","Dublin Core:Date Submitted","Dublin Core:Date Issued","Dublin Core:Date Modified","Dublin Core:Date Valid","Dublin Core:Access Rights","Dublin Core:License","Dublin Core:Conforms To","Dublin Core:Has Part","Dublin Core:Has Version","Dublin Core:Is Format Of","Dublin Core:Is Referenced By","Dublin Core:Is Replaced By","Dublin Core:Is Required By","Dublin Core:Is Version Of","Dublin Core:References","Dublin Core:Replaces","Dublin Core:Requires","Dublin Core:Extent","Dublin Core:Medium","Dublin Core:Bibliographic Citation","Dublin Core:Accrual Method","Dublin Core:Accrual Periodicity","Dublin Core:Accrual Policy","Dublin Core:Audience","Dublin Core:Audience Education Level","Dublin Core:Mediator","Dublin Core:Instructional Method","Dublin Core:Rights Holder","Item Type Metadata:Text","Item Type Metadata:Interviewer","Item Type Metadata:Interviewee","Item Type Metadata:Location","Item Type Metadata:Transcription","Item Type Metadata:Local URL","Item Type Metadata:Original Format","Item Type Metadata:Physical Dimensions","Item Type Metadata:Duration","Item Type Metadata:Compression","Item Type Metadata:Producer","Item Type Metadata:Director","Item Type Metadata:Bit Rate/Frequency","Item Type Metadata:Time Summary","Item Type Metadata:Email Body","Item Type Metadata:Subject Line","Item Type Metadata:From","Item Type Metadata:To","Item Type Metadata:CC","Item Type Metadata:BCC","Item Type Metadata:Number of Attachments","Item Type Metadata:Standards","Item Type Metadata:Objectives","Item Type Metadata:Materials","Item Type Metadata:Lesson Plan Text","Item Type Metadata:URL","Item Type Metadata:Event Type","Item Type Metadata:Participants","Item Type Metadata:Birth Date","Item Type Metadata:Birthplace","Item Type Metadata:Death Date","Item Type Metadata:Occupation","Item Type Metadata:Biographical Text","Item Type Metadata:Bibliography","Item Type Metadata:Player","Item Type Metadata:Imported Thumbnail","Item Type Metadata:OHMS Object","Item Type Metadata:OHMS Object Text","Item Type Metadata:Interview Keyword","Item Type Metadata:Sort Priority","PDF Text:Text",Scripto:Transcription,tags,file,itemType,collection,public,featured
5061,http://libarchstor2.uah.edu/digitalcollections/items/show/5061,img_00427;img_00428,"Lobby of Y.M.C.A. ",,"Front: Lobby of Y.M.C.A. Huntsville, Ala.",,"S. H. Kress & Co.",1912,1910-1919,"203 Greene Street SE","34.731448,-86.583424","Miscellaneous^^Central business districts (Huntsville, Ala.)^^Huntsville (Ala.)^^Madison County (Ala.)",Postcards,,"From the postcard collection of George and Peg Heeschen, The Southpaw, Huntsville, Alabama",,,"This collection is digital only.",en,"This material may be protected under U. S. Copyright Law (Title 17, U.S. Code) which governs the making of photocopies or reproductions of copyrighted materials. You may use the digitized material for private study, scholarship, or research. Though the University of Alabama in Huntsville Archives and Special Collections may have physical ownership of the material in its collections, in some cases we may not own the copyright to the material. It is the patron's obligation to determine and satisfy copyright restrictions when publishing or otherwise distributing materials found in our collections.",postcard_import-210603,,,,,,,,,,,,,,,,,,,,,,,,,,,,,,,,,,,,,,,,,,,,,,,,,,,,,,,,,,,,,,,,,,,,,,,,,,,,,,,http://libarchstor2.uah.edu/digitalcollections/files/original/104/5061/img_00427.pdf,,"Southpaw Postcard Collection",1,0
5062,http://libarchstor2.uah.edu/digitalcollections/items/show/5062,img_00429;img_00430,"Y.M.C.A. Building",,"Front: Y.M.C.A. Building, Huntsville, Ala.",,"S. H. Kress & Co.",,,"203 Greene Street SE","34.731448,-86.583424","Miscellaneous^^Central business districts (Huntsville, Ala.)^^Huntsville (Ala.)^^Madison County (Ala.)",Postcards,,"From the postcard collection of George and Peg Heeschen, The Southpaw, Huntsville, Alabama",,,"This collection is digital only.",en,"This material may be protected under U. S. Copyright Law (Title 17, U.S. Code) which governs the making of photocopies or reproductions of copyrighted materials. You may use the digitized material for private study, scholarship, or research. Though the University of Alabama in Huntsville Archives and Special Collections may have physical ownership of the material in its collections, in some cases we may not own the copyright to the material. It is the patron's obligation to determine and satisfy copyright restrictions when publishing or otherwise distributing materials found in our collections.",postcard_import-210603,,,,,,,,,,,,,,,,,,,,,,,,,,,,,,,,,,,,,,,,,,,,,,,,,,,,,,,,,,,,,,,,,,,,,,,,,,,,,,,http://libarchstor2.uah.edu/digitalcollections/files/original/104/5062/img_00429.pdf,,"Southpaw Postcard Collection",1,0
5068,http://libarchstor2.uah.edu/digitalcollections/items/show/5068,img_00443;img_00444,"Harrison Brothers Hardware Interior",,"Front: Harrison Brothers Hardware Store, Huntsville, Alabama<br />Back: Harrison Brothers Hardware Store, 124 South Side Square - Huntsville, Alabama<br />Located on the Courthouse Square since 1897, Harrison Brothers Hardware Store carries a varied line of Hardware, Crockery, Ironware, Chairs, Gifts, and hard-to-find items. The store is operated by the Historic Huntsville Foundation.",,,,,"124 South Side Square","34.729947,-86.584404","Business enterprises (Huntsville, Ala.)^^Central business districts (Huntsville, Ala.)^^Huntsville (Ala.)^^Madison County (Ala.)",Postcards,,"From the postcard collection of George and Peg Heeschen, The Southpaw, Huntsville, Alabama",,,"This collection is digital only.",en,"This material may be protected under U. S. Copyright Law (Title 17, U.S. Code) which governs the making of photocopies or reproductions of copyrighted materials. You may use the digitized material for private study, scholarship, or research. Though the University of Alabama in Huntsville Archives and Special Collections may have physical ownership of the material in its collections, in some cases we may not own the copyright to the material. It is the patron's obligation to determine and satisfy copyright restrictions when publishing or otherwise distributing materials found in our collections.",postcard_import-210603,,,,,,,,,,,,,,,,,,,,,,,,,,,,,,,,,,,,,,,,,,,,,,,,,,,,,,,,,,,,,,,,,,,,,,,,,,,,,,,http://libarchstor2.uah.edu/digitalcollections/files/original/104/5068/img_00443.pdf,,"Southpaw Postcard Collection",1,0
5069,http://libarchstor2.uah.edu/digitalcollections/items/show/5069,img_00445;img_00446,"Harrison Brothers Hardware",,"Front: Harrison Brothers Hardware Store, Huntsville, Alabama<br />Back: Harrison Brothers Hardware Store, 124 South Side Square - Huntsville, Alabama<br />Located on the Courthouse Square since 1897, Harrison Brothers Hardware Store carries a varied line of Hardware, Crockery, Ironware, Chairs, Gifts, and hard-to-find items. The store is operated by the Historic Huntsville Foundation.",,,,,"124 South Side Square","34.729947,-86.584404","Business enterprises (Huntsville, Ala.)^^Central business districts (Huntsville, Ala.)^^Huntsville (Ala.)^^Madison County (Ala.)",Postcards,,"From the postcard collection of George and Peg Heeschen, The Southpaw, Huntsville, Alabama",,,"This collection is digital only.",en,"This material may be protected under U. S. Copyright Law (Title 17, U.S. Code) which governs the making of photocopies or reproductions of copyrighted materials. You may use the digitized material for private study, scholarship, or research. Though the University of Alabama in Huntsville Archives and Special Collections may have physical ownership of the material in its collections, in some cases we may not own the copyright to the material. It is the patron's obligation to determine and satisfy copyright restrictions when publishing or otherwise distributing materials found in our collections.",postcard_import-210603,,,,,,,,,,,,,,,,,,,,,,,,,,,,,,,,,,,,,,,,,,,,,,,,,,,,,,,,,,,,,,,,,,,,,,,,,,,,,,,http://libarchstor2.uah.edu/digitalcollections/files/original/104/5069/img_00445.pdf,,"Southpaw Postcard Collection",1,0
5070,http://libarchstor2.uah.edu/digitalcollections/items/show/5070,img_00449;img_00450,"Hotel Russel Erskine",,"Front: Hotel Russel Erskine, Huntsville, ALA.<br />Back: HOTEL RUSSEL ERSKINE, HUNTSVILLE. ALA.",,,,,"123 Clinton Avenue W","34.730771,-86.587307","Hotels (Huntsville, Ala.)^^Central business districts (Huntsville, Ala.)^^Huntsville (Ala.)^^Madison County (Ala.)",Postcards,,"From the postcard collection of George and Peg Heeschen, The Southpaw, Huntsville, Alabama",,,"This collection is digital only.",en,"This material may be protected under U. S. Copyright Law (Title 17, U.S. Code) which governs the making of photocopies or reproductions of copyrighted materials. You may use the digitized material for private study, scholarship, or research. Though the University of Alabama in Huntsville Archives and Special Collections may have physical ownership of the material in its collections, in some cases we may not own the copyright to the material. It is the patron's obligation to determine and satisfy copyright restrictions when publishing or otherwise distributing materials found in our collections.",postcard_import-210603,,,,,,,,,,,,,,,,,,,,,,,,,,,,,,,,,,,,,,,,,,,,,,,,,,,,,,,,,,,,,,,,,,,,,,,,,,,,,,,http://libarchstor2.uah.edu/digitalcollections/files/original/104/5070/img_00449.pdf,,"Southpaw Postcard Collection",1,0
5071,http://libarchstor2.uah.edu/digitalcollections/items/show/5071,img_00451;img_00452,"Most Modern Hotel in the Tennessee Valley",,"Front: The Most Modern Hotel in the Tennessee Valley. Hotel Russel Erskine, Huntsville, ALA.<br />Back: HOTEL RUSSEL ERSKINE, HUNTSVILLE. ALA.<br />150 Rooms, each with Bath, Circulating Ice Water, Electric Fan and Radio, Fireproof Garage connecting with Lobby, Air Conditioned Coffee Shop.",,"Curt Teich & Company, Inc., Chicago",,,"123 Clinton Avenue W","34.730771,-86.587307","Hotels (Huntsville, Ala.)^^Central business districts (Huntsville, Ala.)^^Huntsville (Ala.)^^Madison County (Ala.)",Postcards,,"From the postcard collection of George and Peg Heeschen, The Southpaw, Huntsville, Alabama",,,"This collection is digital only.",en,"This material may be protected under U. S. Copyright Law (Title 17, U.S. Code) which governs the making of photocopies or reproductions of copyrighted materials. You may use the digitized material for private study, scholarship, or research. Though the University of Alabama in Huntsville Archives and Special Collections may have physical ownership of the material in its collections, in some cases we may not own the copyright to the material. It is the patron's obligation to determine and satisfy copyright restrictions when publishing or otherwise distributing materials found in our collections.",postcard_import-210603,,,,,,,,,,,,,,,,,,,,,,,,,,,,,,,,,,,,,,,,,,,,,,,,,,,,,,,,,,,,,,,,,,,,,,,,,,,,,,,http://libarchstor2.uah.edu/digitalcollections/files/original/104/5071/img_00451.pdf,,"Southpaw Postcard Collection",1,0
5072,http://libarchstor2.uah.edu/digitalcollections/items/show/5072,img_00457;img_00458,"Hotel Russel Erskine",,"Front: Hotel Russel Erskine, Huntsville, Ala.",,"Curt Teich & Company, Inc., Chicago",,,"123 Clinton Avenue W","34.730771,-86.587307","Hotels (Huntsville, Ala.)^^Central business districts (Huntsville, Ala.)^^Huntsville (Ala.)^^Madison County (Ala.)",Postcards,,"From the postcard collection of George and Peg Heeschen, The Southpaw, Huntsville, Alabama",,,"This collection is digital only.",en,"This material may be protected under U. S. Copyright Law (Title 17, U.S. Code) which governs the making of photocopies or reproductions of copyrighted materials. You may use the digitized material for private study, scholarship, or research. Though the University of Alabama in Huntsville Archives and Special Collections may have physical ownership of the material in its collections, in some cases we may not own the copyright to the material. It is the patron's obligation to determine and satisfy copyright restrictions when publishing or otherwise distributing materials found in our collections.",postcard_import-210603,,,,,,,,,,,,,,,,,,,,,,,,,,,,,,,,,,,,,,,,,,,,,,,,,,,,,,,,,,,,,,,,,,,,,,,,,,,,,,,http://libarchstor2.uah.edu/digitalcollections/files/original/104/5072/img_00457.pdf,,"Southpaw Postcard Collection",1,0
5073,http://libarchstor2.uah.edu/digitalcollections/items/show/5073,img_00459;img_00460,"Hotel Russel Erskine, Alabama's Friendliest",,"Front: Alabama's Friendliest<br />Back: RUSSEL ERSKINE HOTEL, Huntsville. Ala. 36804<br />150 Rooms, with all facilities expected of a modern Hotel,",,"Hannau-Robinson Color Productions, Orlando, FL",,,"123 Clinton Avenue W","34.730771,-86.587307","Hotels (Huntsville, Ala.)^^Central business districts (Huntsville, Ala.)^^Huntsville (Ala.)^^Madison County (Ala.)",Postcards,,"From the postcard collection of George and Peg Heeschen, The Southpaw, Huntsville, Alabama",,,"This collection is digital only.",en,"This material may be protected under U. S. Copyright Law (Title 17, U.S. Code) which governs the making of photocopies or reproductions of copyrighted materials. You may use the digitized material for private study, scholarship, or research. Though the University of Alabama in Huntsville Archives and Special Collections may have physical ownership of the material in its collections, in some cases we may not own the copyright to the material. It is the patron's obligation to determine and satisfy copyright restrictions when publishing or otherwise distributing materials found in our collections.",postcard_import-210603,,,,,,,,,,,,,,,,,,,,,,,,,,,,,,,,,,,,,,,,,,,,,,,,,,,,,,,,,,,,,,,,,,,,,,,,,,,,,,,http://libarchstor2.uah.edu/digitalcollections/files/original/104/5073/img_00459.pdf,,"Southpaw Postcard Collection",1,0
5074,http://libarchstor2.uah.edu/digitalcollections/items/show/5074,img_00461;img_00462,"Hotel Russel Erskine, Alabama's Finest Hotel",,"Front: Hotel Russell Erskine, Huntsville, Alabama. Alabama's Finest Hotel.<br />Back: HOTEL RUSSEL ERSKINE, HUNTSVILLE. ALA.<br />150 Rooms, each with Bath, Circulating Ice Water, Electric Fan and Radio, Fireproof Garage connecting with Lobby, Air Conditioned Coffee Shop.",,"Colourpicture Publishers, Inc., Boston, Mass.",,,"123 Clinton Avenue W","34.730771,-86.587307","Hotels (Huntsville, Ala.)^^Central business districts (Huntsville, Ala.)^^Huntsville (Ala.)^^Madison County (Ala.)",Postcards,,"From the postcard collection of George and Peg Heeschen, The Southpaw, Huntsville, Alabama",,,"This collection is digital only.",en,"This material may be protected under U. S. Copyright Law (Title 17, U.S. Code) which governs the making of photocopies or reproductions of copyrighted materials. You may use the digitized material for private study, scholarship, or research. Though the University of Alabama in Huntsville Archives and Special Collections may have physical ownership of the material in its collections, in some cases we may not own the copyright to the material. It is the patron's obligation to determine and satisfy copyright restrictions when publishing or otherwise distributing materials found in our collections.",postcard_import-210603,,,,,,,,,,,,,,,,,,,,,,,,,,,,,,,,,,,,,,,,,,,,,,,,,,,,,,,,,,,,,,,,,,,,,,,,,,,,,,,http://libarchstor2.uah.edu/digitalcollections/files/original/104/5074/img_00461.pdf,,"Southpaw Postcard Collection",1,0
5078,http://libarchstor2.uah.edu/digitalcollections/items/show/5078,img_00473;img_00474,"U.S. Post Office",,"Front: U.S. Post Office, Huntsville, Alabama",,"Curt Teich & Company, Inc., Chicago",,,"101 Holmes Avenue NE","34.732449,-86.587064","Public buildings (Huntsville, Ala.)^^Central business districts (Huntsville, Ala.)^^Huntsville (Ala.)^^Madison County (Ala.)",Postcards,,"From the postcard collection of George and Peg Heeschen, The Southpaw, Huntsville, Alabama",,,"This collection is digital only.",en,"This material may be protected under U. S. Copyright Law (Title 17, U.S. Code) which governs the making of photocopies or reproductions of copyrighted materials. You may use the digitized material for private study, scholarship, or research. Though the University of Alabama in Huntsville Archives and Special Collections may have physical ownership of the material in its collections, in some cases we may not own the copyright to the material. It is the patron's obligation to determine and satisfy copyright restrictions when publishing or otherwise distributing materials found in our collections.",postcard_import-210603,,,,,,,,,,,,,,,,,,,,,,,,,,,,,,,,,,,,,,,,,,,,,,,,,,,,,,,,,,,,,,,,,,,,,,,,,,,,,,,http://libarchstor2.uah.edu/digitalcollections/files/original/104/5078/img_00473.pdf,,"Southpaw Postcard Collection",1,0
5080,http://libarchstor2.uah.edu/digitalcollections/items/show/5080,img_00477;img_00478,"U.S. Post Office and Courthouse",,"Front: U.S. Post Office and Court House, Huntsville, Alabama",,"Anderson News Company, Florence, Ala.",,,"101 Holmes Avenue NE","34.732449,-86.587064","Public buildings (Huntsville, Ala.)^^Central business districts (Huntsville, Ala.)^^Huntsville (Ala.)^^Madison County (Ala.)",Postcards,,"From the postcard collection of George and Peg Heeschen, The Southpaw, Huntsville, Alabama",,,"This collection is digital only.",en,"This material may be protected under U. S. Copyright Law (Title 17, U.S. Code) which governs the making of photocopies or reproductions of copyrighted materials. You may use the digitized material for private study, scholarship, or research. Though the University of Alabama in Huntsville Archives and Special Collections may have physical ownership of the material in its collections, in some cases we may not own the copyright to the material. It is the patron's obligation to determine and satisfy copyright restrictions when publishing or otherwise distributing materials found in our collections.",postcard_import-210603,,,,,,,,,,,,,,,,,,,,,,,,,,,,,,,,,,,,,,,,,,,,,,,,,,,,,,,,,,,,,,,,,,,,,,,,,,,,,,,http://libarchstor2.uah.edu/digitalcollections/files/original/104/5080/img_00477.pdf,,"Southpaw Postcard Collection",1,0
5081,http://libarchstor2.uah.edu/digitalcollections/items/show/5081,img_00479;img_00480,"Hotel Twickenham",,"Front: Hotel Twickenham, Huntsville, Ala.",,"M. R. Murray, Huntsville, Ala.",,,"100 Washington Street SE","34.731589,-86.585613","Hotels (Huntsville, Ala.)^^Central business districts (Huntsville, Ala.)^^Huntsville (Ala.)^^Madison County (Ala.)",Postcards,,"From the postcard collection of George and Peg Heeschen, The Southpaw, Huntsville, Alabama",,,"This collection is digital only.",en,"This material may be protected under U. S. Copyright Law (Title 17, U.S. Code) which governs the making of photocopies or reproductions of copyrighted materials. You may use the digitized material for private study, scholarship, or research. Though the University of Alabama in Huntsville Archives and Special Collections may have physical ownership of the material in its collections, in some cases we may not own the copyright to the material. It is the patron's obligation to determine and satisfy copyright restrictions when publishing or otherwise distributing materials found in our collections.",postcard_import-210603,,,,,,,,,,,,,,,,,,,,,,,,,,,,,,,,,,,,,,,,,,,,,,,,,,,,,,,,,,,,,,,,,,,,,,,,,,,,,,,http://libarchstor2.uah.edu/digitalcollections/files/original/104/5081/img_00479.pdf,,"Southpaw Postcard Collection",1,0
5082,http://libarchstor2.uah.edu/digitalcollections/items/show/5082,img_00481;img_00482,"Hotel Twickenham",,"Front: Hotel Twickenham, Huntsville, Ala.",,"E. C. Kropp Co., Milwaukee, Wis.",,,"100 Washington Street SE","34.731589,-86.585613","Hotels (Huntsville, Ala.)^^Central business districts (Huntsville, Ala.)^^Huntsville (Ala.)^^Madison County (Ala.)",Postcards,,"From the postcard collection of George and Peg Heeschen, The Southpaw, Huntsville, Alabama",,,"This collection is digital only.",en,"This material may be protected under U. S. Copyright Law (Title 17, U.S. Code) which governs the making of photocopies or reproductions of copyrighted materials. You may use the digitized material for private study, scholarship, or research. Though the University of Alabama in Huntsville Archives and Special Collections may have physical ownership of the material in its collections, in some cases we may not own the copyright to the material. It is the patron's obligation to determine and satisfy copyright restrictions when publishing or otherwise distributing materials found in our collections.",postcard_import-210603,,,,,,,,,,,,,,,,,,,,,,,,,,,,,,,,,,,,,,,,,,,,,,,,,,,,,,,,,,,,,,,,,,,,,,,,,,,,,,,http://libarchstor2.uah.edu/digitalcollections/files/original/104/5082/img_00481.pdf,,"Southpaw Postcard Collection",1,0
5083,http://libarchstor2.uah.edu/digitalcollections/items/show/5083,img_00485;img_00486,"Hotel Twickenham, Remodeled",,"Front: Twickenham Hotel, Huntsville, Alabama. Strictly Fireproof. Remodeled Throughout. INGRAM &amp; CUNNINGHAM, Lessees, JACK CULLENS, Manager.<br />Back: Twickenham Hotel. Strictly Fireproof. Huntsville, Alabama.",,"E. C. Kropp Co., Milwaukee, Wis.",,,"100 Washington Street SE","34.731589,-86.585613","Hotels (Huntsville, Ala.)^^Central business districts (Huntsville, Ala.)^^Huntsville (Ala.)^^Madison County (Ala.)",Postcards,,"From the postcard collection of George and Peg Heeschen, The Southpaw, Huntsville, Alabama",,,"This collection is digital only.",en,"This material may be protected under U. S. Copyright Law (Title 17, U.S. Code) which governs the making of photocopies or reproductions of copyrighted materials. You may use the digitized material for private study, scholarship, or research. Though the University of Alabama in Huntsville Archives and Special Collections may have physical ownership of the material in its collections, in some cases we may not own the copyright to the material. It is the patron's obligation to determine and satisfy copyright restrictions when publishing or otherwise distributing materials found in our collections.",postcard_import-210603,,,,,,,,,,,,,,,,,,,,,,,,,,,,,,,,,,,,,,,,,,,,,,,,,,,,,,,,,,,,,,,,,,,,,,,,,,,,,,,http://libarchstor2.uah.edu/digitalcollections/files/original/104/5083/img_00485.pdf,,"Southpaw Postcard Collection",1,0