﻿"Item Id","Item URI","Dublin Core:Identifier","Dublin Core:Title","Dublin Core:Alternative Title","Dublin Core:Description","Dublin Core:Creator","Dublin Core:Publisher","Dublin Core:Date","Dublin Core:Temporal Coverage","Dublin Core:Coverage","Dublin Core:Spatial Coverage","Dublin Core:Subject","Dublin Core:Type","Dublin Core:Format","Dublin Core:Source","Dublin Core:Is Part Of","Dublin Core:Has Format","Dublin Core:Provenance","Dublin Core:Language","Dublin Core:Rights","Dublin Core:Relation","Dublin Core:Contributor","Dublin Core:Abstract","Dublin Core:Table Of Contents","Dublin Core:Date Available","Dublin Core:Date Created","Dublin Core:Date Accepted","Dublin Core:Date Copyrighted","Dublin Core:Date Submitted","Dublin Core:Date Issued","Dublin Core:Date Modified","Dublin Core:Date Valid","Dublin Core:Access Rights","Dublin Core:License","Dublin Core:Conforms To","Dublin Core:Has Part","Dublin Core:Has Version","Dublin Core:Is Format Of","Dublin Core:Is Referenced By","Dublin Core:Is Replaced By","Dublin Core:Is Required By","Dublin Core:Is Version Of","Dublin Core:References","Dublin Core:Replaces","Dublin Core:Requires","Dublin Core:Extent","Dublin Core:Medium","Dublin Core:Bibliographic Citation","Dublin Core:Accrual Method","Dublin Core:Accrual Periodicity","Dublin Core:Accrual Policy","Dublin Core:Audience","Dublin Core:Audience Education Level","Dublin Core:Mediator","Dublin Core:Instructional Method","Dublin Core:Rights Holder","Item Type Metadata:Text","Item Type Metadata:Interviewer","Item Type Metadata:Interviewee","Item Type Metadata:Location","Item Type Metadata:Transcription","Item Type Metadata:Local URL","Item Type Metadata:Original Format","Item Type Metadata:Physical Dimensions","Item Type Metadata:Duration","Item Type Metadata:Compression","Item Type Metadata:Producer","Item Type Metadata:Director","Item Type Metadata:Bit Rate/Frequency","Item Type Metadata:Time Summary","Item Type Metadata:Email Body","Item Type Metadata:Subject Line","Item Type Metadata:From","Item Type Metadata:To","Item Type Metadata:CC","Item Type Metadata:BCC","Item Type Metadata:Number of Attachments","Item Type Metadata:Standards","Item Type Metadata:Objectives","Item Type Metadata:Materials","Item Type Metadata:Lesson Plan Text","Item Type Metadata:URL","Item Type Metadata:Event Type","Item Type Metadata:Participants","Item Type Metadata:Birth Date","Item Type Metadata:Birthplace","Item Type Metadata:Death Date","Item Type Metadata:Occupation","Item Type Metadata:Biographical Text","Item Type Metadata:Bibliography","Item Type Metadata:Player","Item Type Metadata:Imported Thumbnail","Item Type Metadata:OHMS Object","Item Type Metadata:OHMS Object Text","Item Type Metadata:Interview Keyword","Item Type Metadata:Sort Priority","PDF Text:Text",Scripto:Transcription,tags,file,itemType,collection,public,featured
10731,http://libarchstor2.uah.edu/digitalcollections/items/show/10731,norhunorgchanorcororgcha_051608135828.pdf^^spc_stnv_000556,"""Nortronics Huntsville organizational chart.""",,"Nortronics/Northrop corporate organizational chart. Contains descriptions of the staff below the charts.","Northrop Corporation. Nortronics Division^^North American Rockwell Corporation. Rocketdyne Division",,1968-01-01,1960-1969,,,"Saturn project^^Project management","Still Image^^Organizational Charts",,"Saturn V Collection^^Box 24, Folder 35^^University of Alabama in Huntsville Archives, Special Collections, and Digital Initiatives, Huntsville, Alabama",,,,en,"This material may be protected under U. S. Copyright Law (Title 17, U.S. Code) which governs the making of photocopies or reproductions of copyrighted materials. You may use the digitized material for private study, scholarship, or research. Though the University of Alabama in Huntsville Archives and Special Collections has physical ownership of the material in its collections, in some cases we may not own the copyright to the material. It is the patron's obligation to determine and satisfy copyright restrictions when publishing or otherwise distributing materials found in our collections.",spc_stnv_000550_000574,,,,,,,,,,,,,,,,,,http://libarchstor.uah.edu:8081/repositories/2/archival_objects/17798,,,,,,,,,,,,,,,,,,,,,,,,,,,,,,,,,,,,,,,,,,,,,,,,,,,,,,,,,,,,,http://libarchstor2.uah.edu/digitalcollections/files/original/20/10731/norhunorgchanorcororgcha_051608135828.pdf,,"Saturn V Collection",1,0
10730,http://libarchstor2.uah.edu/digitalcollections/items/show/10730,NondesTest_021508092714.pdf^^spc_stnv_000555,"""Nondestructive testing of space vehicle liquid propellant rocket engines.""",,"Presented at the Western Metals Congress, Los Angeles, California, 15 March 1967.;  Archive copy is a photocopy.;  ABSTRACT: This report describes the various nondestructive test methods employed to evaluate materials and processes used in the manufacture of large liquid propellant rocket engines at the Rocketdyne Division of North American Aviation, Inc. The contents of the paper were purposely oriented for an audience of aerospace, design and materials engineers.  A brief description of liquid propellant rocket engine reliability is presented. The relationship of standards and specifications to nondestructive testing is discussed and various test methods are described along with a discussion of their applications and limitations. The sequence of events leading up to the use of nondestructive testing in production inspection is presented. Finally, the organization of labor directly related to nondestructive testing is given.","Hagemaier, D.^^North American Rockwell Corporation. Rocketdyne Division",,1967-03-15,1960-1969,,,"Saturn project^^Nondestructive testing^^Liquid propellant rocket engines",Text^^Reports,,"Saturn V Collection^^Box 21, Folder 12^^University of Alabama in Huntsville Archives, Special Collections, and Digital Initiatives, Huntsville, Alabama",,,,en,"This material may be protected under U. S. Copyright Law (Title 17, U.S. Code) which governs the making of photocopies or reproductions of copyrighted materials. You may use the digitized material for private study, scholarship, or research. Though the University of Alabama in Huntsville Archives and Special Collections has physical ownership of the material in its collections, in some cases we may not own the copyright to the material. It is the patron's obligation to determine and satisfy copyright restrictions when publishing or otherwise distributing materials found in our collections.",spc_stnv_000550_000574,,,,,,,,,,,,,,,,,,http://libarchstor.uah.edu:8081/repositories/2/archival_objects/17639,,,,,,,,,,,,,,,,,,,,,,,,,,,,,,,,,,,,,,,,,,,,,,,,,,,,,,,,,,,,,http://libarchstor2.uah.edu/digitalcollections/files/original/20/10730/NondesTest_021508092714.pdf,,"Saturn V Collection",1,0
10729,http://libarchstor2.uah.edu/digitalcollections/items/show/10729,NoisReduStudScalModeAcouTestFaci_072508164059.pdf^^spc_stnv_000554,"""Noise reduction study in a scaled model acoustic test facility.""",,"The acoustic properties of five insulation materials were investigated in a 1/10- scale model acoustic facility. The materials were designed for applications in space vehicles. The model facility, consisting of a reverberation chamber coupled to an anechoic chamber, was evaluated for its use in noise reduction testing. It was found that a reasonably diffuse sound field existed above 900 Hertz. Modal density graphs of the reverberation chamber and spatial acoustic gradients measured within the chamber and across the test panel opening are compared to an idealized facility.;   Prepared for the 75th Meeting of the Acoustical Society of America,Ottawa, Ontario, Canada. May 21 - 24, 1968.","Tomren, R. H.",,1968-05-24,1960-1969,,,"Saturn project^^Space vehicles--Noise^^Apollo applications program^^Workshops^^Noise reduction",Text^^Studies,,"Saturn V Collection^^Box 26, Folder 38^^University of Alabama in Huntsville Archives, Special Collections, and Digital Initiatives, Huntsville, Alabama",,,,en,"This material may be protected under U. S. Copyright Law (Title 17, U.S. Code) which governs the making of photocopies or reproductions of copyrighted materials. You may use the digitized material for private study, scholarship, or research. Though the University of Alabama in Huntsville Archives and Special Collections has physical ownership of the material in its collections, in some cases we may not own the copyright to the material. It is the patron's obligation to determine and satisfy copyright restrictions when publishing or otherwise distributing materials found in our collections.",spc_stnv_000550_000574,,,,,,,,,,,,,,,,,,http://libarchstor.uah.edu:8081/repositories/2/archival_objects/17885,,,,,,,,,,,,,,,,,,,,,,,,,,,,,,,,,,,,,,,,,,,,,,,,,,,,,,,,,,,,,http://libarchstor2.uah.edu/digitalcollections/files/original/20/10729/NoisReduStudScalModeAcouTestFaci_072508164059.pdf,,"Saturn V Collection",1,0
10728,http://libarchstor2.uah.edu/digitalcollections/items/show/10728,Nextstopthemoon.pdf^^spc_stnv_000552,"""Next stop : the moon.""",,"Release describing the launch of the Apollo 11.","McDonnell Douglas Corporation",,,1960-1969,,,"Saturn project^^Apollo project^^Liquid propellant rockets^^Saturn S-4B stage","Text^^Press Releases",,"Saturn V Collection^^University of Alabama in Huntsville Archives, Special Collections, and Digital Initiatives, Huntsville, Alabama",,,,en,"This material may be protected under U. S. Copyright Law (Title 17, U.S. Code) which governs the making of photocopies or reproductions of copyrighted materials. You may use the digitized material for private study, scholarship, or research. Though the University of Alabama in Huntsville Archives and Special Collections has physical ownership of the material in its collections, in some cases we may not own the copyright to the material. It is the patron's obligation to determine and satisfy copyright restrictions when publishing or otherwise distributing materials found in our collections.",spc_stnv_000550_000574,,,,,,,,,,,,,,,,,,,,,,,,,,,,,,,,,,,,,,,,,,,,,,,,,,,,,,,,,,,,,,,,,,,,,,,,,,,,,,,http://libarchstor2.uah.edu/digitalcollections/files/original/20/10728/nextstopthemoon_030209161111.pdf,,"Saturn V Collection",1,0
10727,http://libarchstor2.uah.edu/digitalcollections/items/show/10727,"Nextdecainspac_092910155610.pdf   DATE AND TITLE WRONG^^spc_stnv_000551","""Post-Apollo space program report: directions for the future.""",,"Summary of President's Advisory Committee report to the President's Space Task Group.","President's Science Advisory Committee",,1969-09-01,1960-1969,,,"Saturn project^^Summary",Text^^Reports,,"Saturn V Collection^^Box 8/20/1969 to 9/10/1969^^University of Alabama in Huntsville Archives, Special Collections, and Digital Initiatives, Huntsville, Alabama",,,,en,"This material may be protected under U. S. Copyright Law (Title 17, U.S. Code) which governs the making of photocopies or reproductions of copyrighted materials. You may use the digitized material for private study, scholarship, or research. Though the University of Alabama in Huntsville Archives and Special Collections has physical ownership of the material in its collections, in some cases we may not own the copyright to the material. It is the patron's obligation to determine and satisfy copyright restrictions when publishing or otherwise distributing materials found in our collections.",spc_stnv_000550_000574,,,,,,,,,,,,,,,,,,http://libarchstor.uah.edu:8081/repositories/2/archival_objects/21094,,,,,,,,,,,,,,,,,,,,,,,,,,,,,,,,,,,,,,,,,,,,,,,,,,,,,,,,,,,,,http://libarchstor2.uah.edu/digitalcollections/files/original/20/10727/Nextdecainspac_092910155610.pdf,,"Saturn V Collection",1,0
10726,http://libarchstor2.uah.edu/digitalcollections/items/show/10726,newsrocketdyne_062907104301.pdf,"""News from Rocketdyne : Project Saturn.""",,"Press release exploring the rockets and projects of the Saturn project.","North American Rockwell Corporation. Rocketdyne Division",,1964-03-06,1960-1969,,,"Saturn project^^Saturn launch vehicles^^Liquid propellant rocket engines","Text^^Press Releases",,"Saturn V Collection^^University of Alabama in Huntsville Archives, Special Collections, and Digital Initiatives, Huntsville, Alabama",,,,en,"This material may be protected under U. S. Copyright Law (Title 17, U.S. Code) which governs the making of photocopies or reproductions of copyrighted materials. You may use the digitized material for private study, scholarship, or research. Though the University of Alabama in Huntsville Archives and Special Collections has physical ownership of the material in its collections, in some cases we may not own the copyright to the material. It is the patron's obligation to determine and satisfy copyright restrictions when publishing or otherwise distributing materials found in our collections.",spc_stnv_000550_000574,,,,,,,,,,,,,,,,,,,,,,,,,,,,,,,,,,,,,,,,,,,,,,,,,,,,,,,,,,,,,,,,,,,,,,,,,,,,,,,http://libarchstor2.uah.edu/digitalcollections/files/original/20/10726/newsrocketdyne_062907104301.pdf,,"Saturn V Collection",1,0
10725,http://libarchstor2.uah.edu/digitalcollections/items/show/10725,newsreleaseliqhydrog_041207113432.pdf^^spc_stnv_000550,"""News release : Liquid Hydrogen.""",,"Press release covering the nature and use of liquid hydrogen","Douglas Aircraft Company, Inc.",,1962-05-23,1960-1969,,,"Saturn project^^Liquid hydrogen","Text^^Press Releases",,"Saturn V Collection^^University of Alabama in Huntsville Archives, Special Collections, and Digital Initiatives, Huntsville, Alabama",,,,en,"This material may be protected under U. S. Copyright Law (Title 17, U.S. Code) which governs the making of photocopies or reproductions of copyrighted materials. You may use the digitized material for private study, scholarship, or research. Though the University of Alabama in Huntsville Archives and Special Collections has physical ownership of the material in its collections, in some cases we may not own the copyright to the material. It is the patron's obligation to determine and satisfy copyright restrictions when publishing or otherwise distributing materials found in our collections.",spc_stnv_000550_000574,,,,,,,,,,,,,,,,,,,,,,,,,,,,,,,,,,,,,,,,,,,,,,,,,,,,,,,,,,,,,,,,,,,,,,,,,,,,,,,http://libarchstor2.uah.edu/digitalcollections/files/original/20/10725/newsreleaseliqhydrog_041207113432.pdf,,"Saturn V Collection",1,0
10724,http://libarchstor2.uah.edu/digitalcollections/items/show/10724,Personneladmin_081808150533.pdf^^spc_stnv_000599,"""Personnel administration.""",,"Presented at the Society for Personnel Administration. Discusses the problems with the current administration.","O'Connor, E. F.",,1968-06-18,1960-1969,,,"Saturn project^^Personnel management",Speeches,,"Saturn V Collection^^Box  27, Folder 12^^University of Alabama in Huntsville Archives, Special Collections, and Digital Initiatives, Huntsville, Alabama",,,,en,"This material may be protected under U. S. Copyright Law (Title 17, U.S. Code) which governs the making of photocopies or reproductions of copyrighted materials. You may use the digitized material for private study, scholarship, or research. Though the University of Alabama in Huntsville Archives and Special Collections has physical ownership of the material in its collections, in some cases we may not own the copyright to the material. It is the patron's obligation to determine and satisfy copyright restrictions when publishing or otherwise distributing materials found in our collections.",spc_stnv_000575_000599,,,,,,,,,,,,,,,,,,http://libarchstor.uah.edu:8081/repositories/2/archival_objects/17899,,,,,,,,,,,,,,,,,,,,,,,,,,,,,,,,,,,,,,,,,,,,,,,,,,,,,,,,,,,,,http://libarchstor2.uah.edu/digitalcollections/files/original/20/10724/Personneladmin_081808150533.pdf,,"Saturn V Collection",1,0
10723,http://libarchstor2.uah.edu/digitalcollections/items/show/10723,Persarepobibl_111810115549.pdf^^spc_stnv_000598,"""Pershing (u): a report bibliography.""",,"List of unclassified reports.","Defense Documentation Center (U.S.)",,1969-08-19,1960-1969,,,"Saturn project^^Reports",Bibliographies,,"Saturn V Collection^^Box 32, Folder 35^^University of Alabama in Huntsville Archives, Special Collections, and Digital Initiatives, Huntsville, Alabama",,,,en,"This material may be protected under U. S. Copyright Law (Title 17, U.S. Code) which governs the making of photocopies or reproductions of copyrighted materials. You may use the digitized material for private study, scholarship, or research. Though the University of Alabama in Huntsville Archives and Special Collections has physical ownership of the material in its collections, in some cases we may not own the copyright to the material. It is the patron's obligation to determine and satisfy copyright restrictions when publishing or otherwise distributing materials found in our collections.",spc_stnv_000575_000599,,,,,,,,,,,,,,,,,,http://libarchstor.uah.edu:8081/repositories/2/archival_objects/18223,,,,,,,,,,,,,,,,,,,,,,,,,,,,,,,,,,,,,,,,,,,,,,,,,,,,,,,,,,,,,http://libarchstor2.uah.edu/digitalcollections/files/original/20/10723/Persarepobibl_111810115549.pdf,,"Saturn V Collection",1,0
10722,http://libarchstor2.uah.edu/digitalcollections/items/show/10722,pdf_043008093902.pdf^^spc_stnv_000597,"""Apollo 4 press kit.""",,"The flrst flight test of the Apollo/Saturn V space vehicle is scheduled for launch from the Natlonal Aeronautics and Space Administration's John F, Kennedy Space Center, Fla., no earlier than Nov. 7. The mission is designated Apollo 4.","NASA News",,1967-11-02,1960-1969,,,"Saturn project^^Apollo project^^Saturn launch vehicles^^Apollo spacecraft^^Saturn V launch vehicles^^Flight tests","Press Releases",,"Saturn V Collection^^Box 23, Folder 66^^University of Alabama in Huntsville Archives, Special Collections, and Digital Initiatives, Huntsville, Alabama",,,,en,"This material may be protected under U. S. Copyright Law (Title 17, U.S. Code) which governs the making of photocopies or reproductions of copyrighted materials. You may use the digitized material for private study, scholarship, or research. Though the University of Alabama in Huntsville Archives and Special Collections has physical ownership of the material in its collections, in some cases we may not own the copyright to the material. It is the patron's obligation to determine and satisfy copyright restrictions when publishing or otherwise distributing materials found in our collections.",spc_stnv_000575_000599,,,,,,,,,,,,,,,,,,http://libarchstor.uah.edu:8081/repositories/2/archival_objects/17756,,,,,,,,,,,,,,,,,,,,,,,,,,,,,,,,,,,,,,,,,,,,,,,,,,,,,,,,,,,,,http://libarchstor2.uah.edu/digitalcollections/files/original/20/10722/pdf_043008093902.pdf,,"Saturn V Collection",1,0
10721,http://libarchstor2.uah.edu/digitalcollections/items/show/10721,pdf_041808164234.pdf^^spc_stnv_000596,"""MSFC projects index by laboratory.""",,"Project indexes included for: Advanced Systems Office, Aero-Astrodynamics Laboratory, Astrionics Laboratory, Computation Laboratory, Engineering Computation Division, Manufacturing Engineering Laboratory, Propulsion and Vehicle Engineering Laboratory, Quality and Reliability Assurance Laboratory, Research and Development Operations, Research Projects Laboratory, and Test Laboratory.","George C. Marshall Space Flight Center",,1967-11-16,1960-1969,,,"Saturn project^^George C. Marshall Space Flight Center^^Project management",Lists,,"Saturn V Collection^^Box 24, Folder 1^^University of Alabama in Huntsville Archives, Special Collections, and Digital Initiatives, Huntsville, Alabama",,,,en,"This material may be protected under U. S. Copyright Law (Title 17, U.S. Code) which governs the making of photocopies or reproductions of copyrighted materials. You may use the digitized material for private study, scholarship, or research. Though the University of Alabama in Huntsville Archives and Special Collections has physical ownership of the material in its collections, in some cases we may not own the copyright to the material. It is the patron's obligation to determine and satisfy copyright restrictions when publishing or otherwise distributing materials found in our collections.",spc_stnv_000575_000599,,,,,,,,,,,,,,,,,,http://libarchstor.uah.edu:8081/repositories/2/archival_objects/17764,,,,,,,,,,,,,,,,,,,,,,,,,,,,,,,,,,,,,,,,,,,,,,,,,,,,,,,,,,,,,http://libarchstor2.uah.edu/digitalcollections/files/original/20/10721/pdf_041808164234.pdf,,"Saturn V Collection",1,0
10720,http://libarchstor2.uah.edu/digitalcollections/items/show/10720,pdf_041008090254.pdf^^spc_stnv_000595,"""Aero-Astrodynamics Laboratory bimonthly progress report : August and September 1967.""",,"Includes: Projects Office; Advanced Studies Office; Aerospace Environment Division; Astrodynamics and Guidance Theory Division; Aerophysics Division; Dynamics and Fight Mechanics Division; Flight Test Division.","George C. Marshall Space Flight Center. Aero-Astrodynamics Laboratory",,1967-10-01,1960-1969,,,"Saturn project^^Aero-Astrodynamics Laboratory--Management^^Aero-Astrodynamics Laboratory--Planning^^Project management","Progress Reports",,"Saturn V Collection^^University of Alabama in Huntsville Archives, Special Collections, and Digital Initiatives, Huntsville, Alabama",,,,en,"This material may be protected under U. S. Copyright Law (Title 17, U.S. Code) which governs the making of photocopies or reproductions of copyrighted materials. You may use the digitized material for private study, scholarship, or research. Though the University of Alabama in Huntsville Archives and Special Collections has physical ownership of the material in its collections, in some cases we may not own the copyright to the material. It is the patron's obligation to determine and satisfy copyright restrictions when publishing or otherwise distributing materials found in our collections.",spc_stnv_000575_000599,,,,,,,,,,,,,,,,,,,,,,,,,,,,,,,,,,,,,,,,,,,,,,,,,,,,,,,,,,,,,,,,,,,,,,,,,,,,,,,http://libarchstor2.uah.edu/digitalcollections/files/original/20/10720/pdf_041008090254.pdf,,"Saturn V Collection",1,0