﻿"Item Id","Item URI","Dublin Core:Identifier","Dublin Core:Title","Dublin Core:Alternative Title","Dublin Core:Description","Dublin Core:Creator","Dublin Core:Publisher","Dublin Core:Date","Dublin Core:Temporal Coverage","Dublin Core:Coverage","Dublin Core:Spatial Coverage","Dublin Core:Subject","Dublin Core:Type","Dublin Core:Format","Dublin Core:Source","Dublin Core:Is Part Of","Dublin Core:Has Format","Dublin Core:Provenance","Dublin Core:Language","Dublin Core:Rights","Dublin Core:Relation","Dublin Core:Contributor","Dublin Core:Abstract","Dublin Core:Table Of Contents","Dublin Core:Date Available","Dublin Core:Date Created","Dublin Core:Date Accepted","Dublin Core:Date Copyrighted","Dublin Core:Date Submitted","Dublin Core:Date Issued","Dublin Core:Date Modified","Dublin Core:Date Valid","Dublin Core:Access Rights","Dublin Core:License","Dublin Core:Conforms To","Dublin Core:Has Part","Dublin Core:Has Version","Dublin Core:Is Format Of","Dublin Core:Is Referenced By","Dublin Core:Is Replaced By","Dublin Core:Is Required By","Dublin Core:Is Version Of","Dublin Core:References","Dublin Core:Replaces","Dublin Core:Requires","Dublin Core:Extent","Dublin Core:Medium","Dublin Core:Bibliographic Citation","Dublin Core:Accrual Method","Dublin Core:Accrual Periodicity","Dublin Core:Accrual Policy","Dublin Core:Audience","Dublin Core:Audience Education Level","Dublin Core:Mediator","Dublin Core:Instructional Method","Dublin Core:Rights Holder","Item Type Metadata:Text","Item Type Metadata:Interviewer","Item Type Metadata:Interviewee","Item Type Metadata:Location","Item Type Metadata:Transcription","Item Type Metadata:Local URL","Item Type Metadata:Original Format","Item Type Metadata:Physical Dimensions","Item Type Metadata:Duration","Item Type Metadata:Compression","Item Type Metadata:Producer","Item Type Metadata:Director","Item Type Metadata:Bit Rate/Frequency","Item Type Metadata:Time Summary","Item Type Metadata:Email Body","Item Type Metadata:Subject Line","Item Type Metadata:From","Item Type Metadata:To","Item Type Metadata:CC","Item Type Metadata:BCC","Item Type Metadata:Number of Attachments","Item Type Metadata:Standards","Item Type Metadata:Objectives","Item Type Metadata:Materials","Item Type Metadata:Lesson Plan Text","Item Type Metadata:URL","Item Type Metadata:Event Type","Item Type Metadata:Participants","Item Type Metadata:Birth Date","Item Type Metadata:Birthplace","Item Type Metadata:Death Date","Item Type Metadata:Occupation","Item Type Metadata:Biographical Text","Item Type Metadata:Bibliography","Item Type Metadata:Player","Item Type Metadata:Imported Thumbnail","Item Type Metadata:OHMS Object","Item Type Metadata:OHMS Object Text","Item Type Metadata:Interview Keyword","Item Type Metadata:Sort Priority","PDF Text:Text",Scripto:Transcription,tags,file,itemType,collection,public,featured
4407,http://libarchstor2.uah.edu/digitalcollections/items/show/4407,loc_burw_000959,"Photograph of a street with damaged buildings.",,,"Burwell, Edwin D. III [Burwell, Edwin D., Jr.]",,1944,1940-1949,,,"World War, 1939-1945--Campaigns--Italy^^Naples (Italy)","Photographs^^Still Image",,"Burwell Family Collection^^University of Alabama in Huntsville Archives, Special Collections, and Digital Initiatives, Huntsville, Alabama",,,,en,"This material may be protected under U. S. Copyright Law (Title 17, U.S. Code) which governs the making of photocopies or reproductions of copyrighted materials. You may use the digitized material for private study, scholarship, or research. Though the University of Alabama in Huntsville Archives and Special Collections has physical ownership of the material in its collections, in some cases we may not own the copyright to the material. It is the patron's obligation to determine and satisfy copyright restrictions when publishing or otherwise distributing materials found in our collections.",loc_burw_2021_04C,,,,,,,,,,,,,,,,,,,,,,,,,,,,,,,,,,,,,,,,,,,,,,,,,,,,,,,,,,,,,,,,,,,,,,,,,,,,,,,http://libarchstor2.uah.edu/digitalcollections/files/original/76/4407/loc_burw-_-959.pdf,,"Burwell Family Collection",1,0
4408,http://libarchstor2.uah.edu/digitalcollections/items/show/4408,loc_burw_000960,"Photograph of a street with damaged buildings.",,,"Burwell, Edwin D. III [Burwell, Edwin D., Jr.]",,1944,1940-1949,,,"World War, 1939-1945--Campaigns--Italy^^Naples (Italy)","Photographs^^Still Image",,"Burwell Family Collection^^University of Alabama in Huntsville Archives, Special Collections, and Digital Initiatives, Huntsville, Alabama",,,,en,"This material may be protected under U. S. Copyright Law (Title 17, U.S. Code) which governs the making of photocopies or reproductions of copyrighted materials. You may use the digitized material for private study, scholarship, or research. Though the University of Alabama in Huntsville Archives and Special Collections has physical ownership of the material in its collections, in some cases we may not own the copyright to the material. It is the patron's obligation to determine and satisfy copyright restrictions when publishing or otherwise distributing materials found in our collections.",loc_burw_2021_04C,,,,,,,,,,,,,,,,,,,,,,,,,,,,,,,,,,,,,,,,,,,,,,,,,,,,,,,,,,,,,,,,,,,,,,,,,,,,,,,http://libarchstor2.uah.edu/digitalcollections/files/original/76/4408/loc_burw-_-960.pdf,,"Burwell Family Collection",1,0
4433,http://libarchstor2.uah.edu/digitalcollections/items/show/4433,loc_burw_000985,"Photograph of a statue in Rome, Italy.",,,"Burwell, Edwin D. III [Burwell, Edwin D., Jr.]",,1944,1940-1949,,,"Statues^^Rome (Italy)^^World War, 1939-1945","Photographs^^Still Image",,"Burwell Family Collection^^University of Alabama in Huntsville Archives, Special Collections, and Digital Initiatives, Huntsville, Alabama",,,,en,"This material may be protected under U. S. Copyright Law (Title 17, U.S. Code) which governs the making of photocopies or reproductions of copyrighted materials. You may use the digitized material for private study, scholarship, or research. Though the University of Alabama in Huntsville Archives and Special Collections has physical ownership of the material in its collections, in some cases we may not own the copyright to the material. It is the patron's obligation to determine and satisfy copyright restrictions when publishing or otherwise distributing materials found in our collections.",loc_burw_2021_04C,,,,,,,,,,,,,,,,,,,,,,,,,,,,,,,,,,,,,,,,,,,,,,,,,,,,,,,,,,,,,,,,,,,,,,,,,,,,,,,http://libarchstor2.uah.edu/digitalcollections/files/original/76/4433/loc_burw-_-985.pdf,,"Burwell Family Collection",1,0
1586,http://libarchstor2.uah.edu/digitalcollections/items/show/1586,spc_spac_000370,"Photograph of a spinning seat ride.",,,,,,1960-1969,,,"Amusement rides","Photographs^^Still Image",,"Space City Collection^^Box 3^^University of Alabama in Huntsville Archives, Special Collections, and Digital Initiatives, Huntsville, Alabama",,,"This collection was generously loaned for digitization by Dustin Shannon. The collection is digital only.",en,"This material may be protected under U. S. Copyright Law (Title 17, U.S. Code) which governs the making of photocopies or reproductions of copyrighted materials. You may use the digitized material for private study, scholarship, or research. Though the University of Alabama in Huntsville Archives and Special Collections has physical ownership of the material in its collections, in some cases we may not own the copyright to the material. It is the patron's obligation to determine and satisfy copyright restrictions when publishing or otherwise distributing materials found in our collections.",spc_spac_2020_02,,,,,,,,,,,,,,,,,,,,,,,,,,,,,,,,,,,,,,,,,,,,,,,,,,,,,,,,,,,,,,,,,,,,,,,,,,,,,,,http://libarchstor2.uah.edu/digitalcollections/files/original/75/1586/spc_spac_000370.pdf,,"Space City Collection",1,0
4638,http://libarchstor2.uah.edu/digitalcollections/items/show/4638,loc_burw_001050,"Photograph of a soldier with papers walking uphill from a military vehicle.",,,"Burwell, Edwin D. III [Burwell, Edwin D., Jr.]",,1944-03,1940-1949,,,"Vehicles, Military^^World War, 1939-1945--Campaigns--Italy^^World War, 1939-1945--Military personnel","Photographs^^Still Image",,"Burwell Family Collection^^University of Alabama in Huntsville Archives, Special Collections, and Digital Initiatives, Huntsville, Alabama",,,,en,"This material may be protected under U. S. Copyright Law (Title 17, U.S. Code) which governs the making of photocopies or reproductions of copyrighted materials. You may use the digitized material for private study, scholarship, or research. Though the University of Alabama in Huntsville Archives and Special Collections has physical ownership of the material in its collections, in some cases we may not own the copyright to the material. It is the patron's obligation to determine and satisfy copyright restrictions when publishing or otherwise distributing materials found in our collections.",loc_burw_2021_04E,,,,,,,,,,,,,,,,,,,,,,,,,,,,,,,,,,,,,,,,,,,,,,,,,,,,,,,,,,,,,,,,,,,,,,,,,,,,,,,http://libarchstor2.uah.edu/digitalcollections/files/original/76/4638/Loc_burw-1050.pdf,,"Burwell Family Collection",1,0
4637,http://libarchstor2.uah.edu/digitalcollections/items/show/4637,loc_burw_001049,"Photograph of a soldier with a clipboard walking uphill from a military vehicle.",,,"Burwell, Edwin D. III [Burwell, Edwin D., Jr.]",,1944-03,1940-1949,,,"Vehicles, Military^^World War, 1939-1945--Campaigns--Italy^^World War, 1939-1945--Military personnel","Photographs^^Still Image",,"Burwell Family Collection^^University of Alabama in Huntsville Archives, Special Collections, and Digital Initiatives, Huntsville, Alabama",,,,en,"This material may be protected under U. S. Copyright Law (Title 17, U.S. Code) which governs the making of photocopies or reproductions of copyrighted materials. You may use the digitized material for private study, scholarship, or research. Though the University of Alabama in Huntsville Archives and Special Collections has physical ownership of the material in its collections, in some cases we may not own the copyright to the material. It is the patron's obligation to determine and satisfy copyright restrictions when publishing or otherwise distributing materials found in our collections.",loc_burw_2021_04E,,,,,,,,,,,,,,,,,,,,,,,,,,,,,,,,,,,,,,,,,,,,,,,,,,,,,,,,,,,,,,,,,,,,,,,,,,,,,,,http://libarchstor2.uah.edu/digitalcollections/files/original/76/4637/Loc_burw-1049.pdf,,"Burwell Family Collection",1,0
4620,http://libarchstor2.uah.edu/digitalcollections/items/show/4620,loc_burw_001032,"Photograph of a soldier followed by two women, one of whom is holding a baby.",,,"Burwell, Edwin D. III [Burwell, Edwin D., Jr.]",,1944-03,1940-1949,,,"Cities and towns^^World War, 1939-1945--Campaigns--Italy^^World War, 1939-1945--Military personnel","Photographs^^Still Image",,"Burwell Family Collection^^University of Alabama in Huntsville Archives, Special Collections, and Digital Initiatives, Huntsville, Alabama",,,,en,"This material may be protected under U. S. Copyright Law (Title 17, U.S. Code) which governs the making of photocopies or reproductions of copyrighted materials. You may use the digitized material for private study, scholarship, or research. Though the University of Alabama in Huntsville Archives and Special Collections has physical ownership of the material in its collections, in some cases we may not own the copyright to the material. It is the patron's obligation to determine and satisfy copyright restrictions when publishing or otherwise distributing materials found in our collections.",loc_burw_2021_04E,,,,,,,,,,,,,,,,,,,,,,,,,,,,,,,,,,,,,,,,,,,,,,,,,,,,,,,,,,,,,,,,,,,,,,,,,,,,,,,http://libarchstor2.uah.edu/digitalcollections/files/original/76/4620/Loc_burw-1032.pdf,,"Burwell Family Collection",1,0
6488,http://libarchstor2.uah.edu/digitalcollections/items/show/6488," loc_burw_2041","Photograph of a small plane in a field, possibly the Huntsville-Madison County Airport.",,,"Burwell, Edwin D. III [Burwell, Edwin D., Jr.]",,"1949 circa",1940-1949,,,"Airports^^Commuter aircraft^^Huntsville (Ala.)^^Madison County (Ala.)","Photographs^^ Still Image","glass slides^^Glass transparencies","Burwell Family Collection^^University of Alabama in Huntsville Archives, Special Collections, and Digital Initiatives, Huntsville, Alabama",,,"This item was generously digitized by Dudley Burwell.",en,"This material may be protected under U. S. Copyright Law (Title 17, U.S. Code) which governs the making of photocopies or reproductions of copyrighted materials. You may use the digitized material for private study, scholarship, or research. Though the University of Alabama in Huntsville Archives and Special Collections has physical ownership of the material in its collections, in some cases we may not own the copyright to the material. It is the patron's obligation to determine and satisfy copyright restrictions when publishing or otherwise distributing materials found in our collections.",loc_burw_2021_06,,,,,,,,,,,,,,,,,,,,,,,,,,,,,,,,,,,,,,,,,,,,,,,,,,,,,,,,,,,,,,,,,,,,,,,,,,,,,,,http://libarchstor2.uah.edu/digitalcollections/files/original/76/6488/Loc_burw-2041.pdf,,"Burwell Family Collection",1,0
4404,http://libarchstor2.uah.edu/digitalcollections/items/show/4404,loc_burw_000956,"Photograph of a skyline view of Naples, Italy.",,,"Burwell, Edwin D. III [Burwell, Edwin D., Jr.]",,1944,1940-1949,,,"Naples (Italy)^^World War, 1939-1945","Photographs^^Still Image",,"Burwell Family Collection^^University of Alabama in Huntsville Archives, Special Collections, and Digital Initiatives, Huntsville, Alabama",,,,en,"This material may be protected under U. S. Copyright Law (Title 17, U.S. Code) which governs the making of photocopies or reproductions of copyrighted materials. You may use the digitized material for private study, scholarship, or research. Though the University of Alabama in Huntsville Archives and Special Collections has physical ownership of the material in its collections, in some cases we may not own the copyright to the material. It is the patron's obligation to determine and satisfy copyright restrictions when publishing or otherwise distributing materials found in our collections.",loc_burw_2021_04C,,,,,,,,,,,,,,,,,,,,,,,,,,,,,,,,,,,,,,,,,,,,,,,,,,,,,,,,,,,,,,,,,,,,,,,,,,,,,,,http://libarchstor2.uah.edu/digitalcollections/files/original/76/4404/loc_burw-_-956.pdf,,"Burwell Family Collection",1,0
4396,http://libarchstor2.uah.edu/digitalcollections/items/show/4396,loc_burw_000948,"Photograph of a sign desribing the fines for certain practices in a II Corps Area.",,"There are eleven different offenses to be fined for. The fines range from two to twenty-five dollars for enlisted men and from five to fifty dollars for officers depending on the manner of the offense.","Burwell, Edwin D. III [Burwell, Edwin D., Jr.]",,1944-02,1940-1949,,,"Fines (Penalties)^^Regulations^^Naples (Italy)","Photographs^^Still Image",,"Burwell Family Collection^^University of Alabama in Huntsville Archives, Special Collections, and Digital Initiatives, Huntsville, Alabama",,,,en,"This material may be protected under U. S. Copyright Law (Title 17, U.S. Code) which governs the making of photocopies or reproductions of copyrighted materials. You may use the digitized material for private study, scholarship, or research. Though the University of Alabama in Huntsville Archives and Special Collections has physical ownership of the material in its collections, in some cases we may not own the copyright to the material. It is the patron's obligation to determine and satisfy copyright restrictions when publishing or otherwise distributing materials found in our collections.",loc_burw_2021_04B,,,,,,,,,,,,,,,,,,,,,,,,,,,,,,,,,,,,,,,,,,,,,,,,,,,,,,,,,,,,,,,,,,,,,,,,,,,,,,,http://libarchstor2.uah.edu/digitalcollections/files/original/76/4396/Loc_burw-948.pdf,,"Burwell Family Collection",1,0
5600,http://libarchstor2.uah.edu/digitalcollections/items/show/5600,loc_burw_1232,"Photograph of a ship leaving the harbor in New York.",,,"Burwell, Edwin D. III [Burwell, Edwin D., Jr.]",,1944-10,1940-1949,,,"New York Harbor (N.Y. and N.J.)","Photographs^^Still Image^^black-and-white prints",,"Burwell Family Collection^^University of Alabama in Huntsville Archives, Special Collections, and Digital Initiatives, Huntsville, Alabama",,,"This item was generously digitized by Dudley Burwell.",en,"This material may be protected under U. S. Copyright Law (Title 17, U.S. Code) which governs the making of photocopies or reproductions of copyrighted materials. You may use the digitized material for private study, scholarship, or research. Though the University of Alabama in Huntsville Archives and Special Collections has physical ownership of the material in its collections, in some cases we may not own the copyright to the material. It is the patron's obligation to determine and satisfy copyright restrictions when publishing or otherwise distributing materials found in our collections.",loc_burw_2021_05,,,,,,,,,,,,,,,,,,,,,,,,,,,,,,,,,,,,,,,,,,,,,,,,,,,,,,,,,,,,,,,,,,,,,,,,,,,,,,,http://libarchstor2.uah.edu/digitalcollections/files/original/76/5600/Loc_burw--1232.pdf,,"Burwell Family Collection",1,0
6180,http://libarchstor2.uah.edu/digitalcollections/items/show/6180," loc_burw_1732","Photograph of a seaplane in Great Britain. ",,,"Burwell, Edwin D. III [Burwell, Edwin D., Jr.]",,1945-09,1940-1949,,,"Seaplanes^^Great Britain","Photographs^^Still Image","black-and-white prints","Burwell Family Collection^^University of Alabama in Huntsville Archives, Special Collections, and Digital Initiatives, Huntsville, Alabama",,,"This item was generously digitized by Dudley Burwell.",en,"This material may be protected under U. S. Copyright Law (Title 17, U.S. Code) which governs the making of photocopies or reproductions of copyrighted materials. You may use the digitized material for private study, scholarship, or research. Though the University of Alabama in Huntsville Archives and Special Collections has physical ownership of the material in its collections, in some cases we may not own the copyright to the material. It is the patron's obligation to determine and satisfy copyright restrictions when publishing or otherwise distributing materials found in our collections.",loc_burw_2021_06,,,,,,,,,,,,,,,,,,,,,,,,,,,,,,,,,,,,,,,,,,,,,,,,,,,,,,,,,,,,,,,,,,,,,,,,,,,,,,,http://libarchstor2.uah.edu/digitalcollections/files/original/76/6180/Loc_burw--1732.pdf,,"Burwell Family Collection",1,0
4390,http://libarchstor2.uah.edu/digitalcollections/items/show/4390,loc_burw_000942,"Photograph of a school group walking down the street in Naples, Italy.",,,"Burwell, Edwin D. III [Burwell, Edwin D., Jr.]",,1944-02,1940-1949,,,"Catholic schools^^Naples (Italy)^^World War, 1939-1945","Photographs^^Still Image",,"Burwell Family Collection^^University of Alabama in Huntsville Archives, Special Collections, and Digital Initiatives, Huntsville, Alabama",,,,en,"This material may be protected under U. S. Copyright Law (Title 17, U.S. Code) which governs the making of photocopies or reproductions of copyrighted materials. You may use the digitized material for private study, scholarship, or research. Though the University of Alabama in Huntsville Archives and Special Collections has physical ownership of the material in its collections, in some cases we may not own the copyright to the material. It is the patron's obligation to determine and satisfy copyright restrictions when publishing or otherwise distributing materials found in our collections.",loc_burw_2021_04B,,,,,,,,,,,,,,,,,,,,,,,,,,,,,,,,,,,,,,,,,,,,,,,,,,,,,,,,,,,,,,,,,,,,,,,,,,,,,,,http://libarchstor2.uah.edu/digitalcollections/files/original/76/4390/Loc_burw-942.pdf,,"Burwell Family Collection",1,0
5944,http://libarchstor2.uah.edu/digitalcollections/items/show/5944," loc_burw_1572","Photograph of a ruined bridge in France.",,,"Burwell, Edwin D. III [Burwell, Edwin D., Jr.]",,1945,1940-1949,,,"Beam bridges^^France^^World War, 1939-1945","Photographs^^Still Image","black-and-white prints","Burwell Family Collection^^University of Alabama in Huntsville Archives, Special Collections, and Digital Initiatives, Huntsville, Alabama",,,"This item was generously digitized by Dudley Burwell.",en,"This material may be protected under U. S. Copyright Law (Title 17, U.S. Code) which governs the making of photocopies or reproductions of copyrighted materials. You may use the digitized material for private study, scholarship, or research. Though the University of Alabama in Huntsville Archives and Special Collections has physical ownership of the material in its collections, in some cases we may not own the copyright to the material. It is the patron's obligation to determine and satisfy copyright restrictions when publishing or otherwise distributing materials found in our collections.",loc_burw_2021_06,,,,,,,,,,,,,,,,,,,,,,,,,,,,,,,,,,,,,,,,,,,,,,,,,,,,,,,,,,,,,,,,,,,,,,,,,,,,,,,http://libarchstor2.uah.edu/digitalcollections/files/original/76/5944/Loc_burw-1572.pdf,,"Burwell Family Collection",1,0
5945,http://libarchstor2.uah.edu/digitalcollections/items/show/5945," loc_burw_1573","Photograph of a ruined bridge in France.",,,"Burwell, Edwin D. III [Burwell, Edwin D., Jr.]",,1945,1940-1949,,,"Beam bridges^^France^^World War, 1939-1945","Photographs^^Still Image","black-and-white prints","Burwell Family Collection^^University of Alabama in Huntsville Archives, Special Collections, and Digital Initiatives, Huntsville, Alabama",,,"This item was generously digitized by Dudley Burwell.",en,"This material may be protected under U. S. Copyright Law (Title 17, U.S. Code) which governs the making of photocopies or reproductions of copyrighted materials. You may use the digitized material for private study, scholarship, or research. Though the University of Alabama in Huntsville Archives and Special Collections has physical ownership of the material in its collections, in some cases we may not own the copyright to the material. It is the patron's obligation to determine and satisfy copyright restrictions when publishing or otherwise distributing materials found in our collections.",loc_burw_2021_06,,,,,,,,,,,,,,,,,,,,,,,,,,,,,,,,,,,,,,,,,,,,,,,,,,,,,,,,,,,,,,,,,,,,,,,,,,,,,,,http://libarchstor2.uah.edu/digitalcollections/files/original/76/5945/Loc_burw-1573.pdf,,"Burwell Family Collection",1,0
5946,http://libarchstor2.uah.edu/digitalcollections/items/show/5946," loc_burw_1574","Photograph of a ruined bridge in France.",,,"Burwell, Edwin D. III [Burwell, Edwin D., Jr.]",,1945,1940-1949,,,"Beam bridges^^France^^World War, 1939-1945","Photographs^^Still Image","black-and-white prints","Burwell Family Collection^^University of Alabama in Huntsville Archives, Special Collections, and Digital Initiatives, Huntsville, Alabama",,,"This item was generously digitized by Dudley Burwell.",en,"This material may be protected under U. S. Copyright Law (Title 17, U.S. Code) which governs the making of photocopies or reproductions of copyrighted materials. You may use the digitized material for private study, scholarship, or research. Though the University of Alabama in Huntsville Archives and Special Collections has physical ownership of the material in its collections, in some cases we may not own the copyright to the material. It is the patron's obligation to determine and satisfy copyright restrictions when publishing or otherwise distributing materials found in our collections.",loc_burw_2021_06,,,,,,,,,,,,,,,,,,,,,,,,,,,,,,,,,,,,,,,,,,,,,,,,,,,,,,,,,,,,,,,,,,,,,,,,,,,,,,,http://libarchstor2.uah.edu/digitalcollections/files/original/76/5946/Loc_burw-1574.pdf,,"Burwell Family Collection",1,0