﻿"Item Id","Item URI","Dublin Core:Identifier","Dublin Core:Title","Dublin Core:Alternative Title","Dublin Core:Description","Dublin Core:Creator","Dublin Core:Publisher","Dublin Core:Date","Dublin Core:Temporal Coverage","Dublin Core:Coverage","Dublin Core:Spatial Coverage","Dublin Core:Subject","Dublin Core:Type","Dublin Core:Format","Dublin Core:Source","Dublin Core:Is Part Of","Dublin Core:Has Format","Dublin Core:Provenance","Dublin Core:Language","Dublin Core:Rights","Dublin Core:Relation","Dublin Core:Contributor","Dublin Core:Abstract","Dublin Core:Table Of Contents","Dublin Core:Date Available","Dublin Core:Date Created","Dublin Core:Date Accepted","Dublin Core:Date Copyrighted","Dublin Core:Date Submitted","Dublin Core:Date Issued","Dublin Core:Date Modified","Dublin Core:Date Valid","Dublin Core:Access Rights","Dublin Core:License","Dublin Core:Conforms To","Dublin Core:Has Part","Dublin Core:Has Version","Dublin Core:Is Format Of","Dublin Core:Is Referenced By","Dublin Core:Is Replaced By","Dublin Core:Is Required By","Dublin Core:Is Version Of","Dublin Core:References","Dublin Core:Replaces","Dublin Core:Requires","Dublin Core:Extent","Dublin Core:Medium","Dublin Core:Bibliographic Citation","Dublin Core:Accrual Method","Dublin Core:Accrual Periodicity","Dublin Core:Accrual Policy","Dublin Core:Audience","Dublin Core:Audience Education Level","Dublin Core:Mediator","Dublin Core:Instructional Method","Dublin Core:Rights Holder","Item Type Metadata:Text","Item Type Metadata:Interviewer","Item Type Metadata:Interviewee","Item Type Metadata:Location","Item Type Metadata:Transcription","Item Type Metadata:Local URL","Item Type Metadata:Original Format","Item Type Metadata:Physical Dimensions","Item Type Metadata:Duration","Item Type Metadata:Compression","Item Type Metadata:Producer","Item Type Metadata:Director","Item Type Metadata:Bit Rate/Frequency","Item Type Metadata:Time Summary","Item Type Metadata:Email Body","Item Type Metadata:Subject Line","Item Type Metadata:From","Item Type Metadata:To","Item Type Metadata:CC","Item Type Metadata:BCC","Item Type Metadata:Number of Attachments","Item Type Metadata:Standards","Item Type Metadata:Objectives","Item Type Metadata:Materials","Item Type Metadata:Lesson Plan Text","Item Type Metadata:URL","Item Type Metadata:Event Type","Item Type Metadata:Participants","Item Type Metadata:Birth Date","Item Type Metadata:Birthplace","Item Type Metadata:Death Date","Item Type Metadata:Occupation","Item Type Metadata:Biographical Text","Item Type Metadata:Bibliography","Item Type Metadata:Player","Item Type Metadata:Imported Thumbnail","Item Type Metadata:OHMS Object","Item Type Metadata:OHMS Object Text","Item Type Metadata:Interview Keyword","Item Type Metadata:Sort Priority","PDF Text:Text",Scripto:Transcription,tags,file,itemType,collection,public,featured
7708,http://libarchstor2.uah.edu/digitalcollections/items/show/7708,r02g07-42,"Query Letter Concerning Weeden, Miss Howard/H. Female Seminary, 1960 ",,,"Edwards, Nannie W.",,1960-06-03,1960-1969,,,"Alabama–History–Huntsville, Madison County^^Genealogy^^Huntsville Female Institute (Ala.)^^Weeden, Howard, 1847-1905",Correspondence,,"Frances Cabaniss Roberts Collection^^Series 2, Subseries G, Box 7, Folder 42^^University of Alabama in Huntsville Archives, Special Collections, and Digital Initiatives, Huntsville, Alabama",,,,en,"This material may be protected under U. S. Copyright Law (Title 17, U.S. Code) which governs the making of photocopies or reproductions of copyrighted materials. You may use the digitized material for private study, scholarship, or research. Though the University of Alabama in Huntsville Archives and Special Collections has physical ownership of the material in its collections, in some cases we may not own the copyright to the material. It is the patron's obligation to determine and satisfy copyright restrictions when publishing or otherwise distributing materials found in our collections.",r02g-210915,,,,,,,,,,,,,,,,,,,,,,,,,,,,,,,,,,,,,,,,,,,,,,,,,,,,,,,,,,,,,,,,,,,,,,,,,,,,,,,http://dkdayton.net/roberts/images/r02g/pdfs/r02g07-42.pdf,"Still Image","Series 02, Subseries G: Roberts Correspondence",1,0
7734,http://libarchstor2.uah.edu/digitalcollections/items/show/7734,r02g07-16,"Query Letter Concerning Edwards Book, to Roberts, Frances C., 1958",,,"Edwards, O. B.",,1958-10-05,1950-1959,,,"Books^^History of the Christian Church^^Professional correspondence^^Qualben, Lars P. (Lars Pederson), 1891-",Correspondence,,"Frances Cabaniss Roberts Collection^^Series 2, Subseries G, Box 7, Folder 16^^University of Alabama in Huntsville Archives, Special Collections, and Digital Initiatives, Huntsville, Alabama",,,,en,"This material may be protected under U. S. Copyright Law (Title 17, U.S. Code) which governs the making of photocopies or reproductions of copyrighted materials. You may use the digitized material for private study, scholarship, or research. Though the University of Alabama in Huntsville Archives and Special Collections has physical ownership of the material in its collections, in some cases we may not own the copyright to the material. It is the patron's obligation to determine and satisfy copyright restrictions when publishing or otherwise distributing materials found in our collections.",r02g-210915,,,,,,,,,,,,,,,,,,,,,,,,,,,,,,,,,,,,,,,,,,,,,,,,,,,,,,,,,,,,,,,,,,,,,,,,,,,,,,,http://dkdayton.net/roberts/images/r02g/pdfs/r02g07-16.pdf,"Still Image","Series 02, Subseries G: Roberts Correspondence",1,0
11121,http://libarchstor2.uah.edu/digitalcollections/items/show/11121,Nexuconc.pdf^^spc_stnv_000553,"""NEXUS concept of a large reusable earth launch vehicle.""",,"Aspects of Earth-to-orbit delivery are discussed and a cost analysis of the logistic operation and the cost of orbital operations are presented.  Probabilities of success of orbital delivery and the operational and economic aspects of establishing large orbital installations and maintaining a large transportation volume in the 1975/85 time period are compared for the two cases using a large number of Saturn V versus a smaller number of 1-stage chemical Post-Saturn launch vehicles.  Performance parameters of chemical, chemonuclear and nuclear launch vehicles are compared.  The concept of a blunt launch vehicle configuration referred to as NEXUS is presented in detail.  Applications of this configuration to chemonuclear propulsion and to a 50 ft diameter version of Saturn V with recoverable first stage are discussed.","Ehricke, Krafft A.",,1963-01-01,1960-1969,,,"Saturn project^^Reusable space vehicles^^Reusable launch vehicles^^Launch vehicles^^Astronautics",Text^^Essays,,"Saturn V Collection^^Box 7, Folder 61^^University of Alabama in Huntsville Archives, Special Collections, and Digital Initiatives, Huntsville, Alabama",,,,en,"This material may be protected under U. S. Copyright Law (Title 17, U.S. Code) which governs the making of photocopies or reproductions of copyrighted materials. You may use the digitized material for private study, scholarship, or research. Though the University of Alabama in Huntsville Archives and Special Collections has physical ownership of the material in its collections, in some cases we may not own the copyright to the material. It is the patron's obligation to determine and satisfy copyright restrictions when publishing or otherwise distributing materials found in our collections.",spc_stnv_000550_000574,,,,,,,,,,,,,,,,,,http://libarchstor.uah.edu:8081/repositories/2/archival_objects/17293,,,,,,,,,,,,,,,,,,,,,,,,,,,,,,,,,,,,,,,,,,,,,,,,,,,,,,,,,,,,,http://libarchstor2.uah.edu/digitalcollections/files/original/20/11121/Nexuconc.pdf,,"Saturn V Collection",1,0
10957,http://libarchstor2.uah.edu/digitalcollections/items/show/10957,InflapolsatuV.pdf^^spc_stnv_000335,"""The Influence of Apollo/Saturn V Launch Operations on Lunar Site Selection: Case 330.""",,"This paper presents some relationships between Apollo/Saturn V launch operations and multiple lunar landing sites, including the means by which site selection could facilitate launch operations.","Eley, C. H.",,1966-04-28,1960-1969,,,"Saturn project^^Lunar surface vehicles^^Lunar landing^^Space vehicles",Text^^Essays,,"Saturn V Collection^^Box 17, Folder 21^^University of Alabama in Huntsville Archives, Special Collections, and Digital Initiatives, Huntsville, Alabama",,,,en,"This material may be protected under U. S. Copyright Law (Title 17, U.S. Code) which governs the making of photocopies or reproductions of copyrighted materials. You may use the digitized material for private study, scholarship, or research. Though the University of Alabama in Huntsville Archives and Special Collections has physical ownership of the material in its collections, in some cases we may not own the copyright to the material. It is the patron's obligation to determine and satisfy copyright restrictions when publishing or otherwise distributing materials found in our collections.",spc_stnv_000325_000349,,,,,,,,,,,,,,,,,,"<a href=""http://libarchstor.uah.edu:8081/repositories/2/archival_objects/17444""> View this item in ArchivesSpace. </a>",,,,,,,,,,,,,,,,,,,,,,,,,,,,,,,,,,,,,,,,,,,,,,,,,,,,,,,,,,,,,http://libarchstor2.uah.edu/digitalcollections/files/original/20/10957/InflapolsatuV_061908163151.pdf,,"Saturn V Collection",1,0
8736,http://libarchstor2.uah.edu/digitalcollections/items/show/8736,r06_01-11,"Elliott, G.S. to Pettus, Richard E. (genealogy correspondence), 1928",,"This section contains correspondence letters centering around the genealogy, family tree and family history of the Pettus family. Contains handwritten notes and images relating to the Pettus family genealogy.","Eliot, G.S.",,1491^^1506^^1566^^1590^^1598^^1608^^1612^^1614^^1621^^1637^^1720^^1772^^1779^^1804^^1928^^1938-05-17^^1940,1490-1499^^1500-1509^^1560-1569^^1590-1599^^1600-1609^^1610-1619^^1620-1629^^1630=1639^^1720-1729^^1770-1779^^1800-1809^^1920-1929^^1930-1939^^1940-1949,,,"Family Trees^^Family Histories",Genealogy^^Correspondence^^Envelope,,"Series 6, Box 1, Folder 11","Frances Cabaniss Roberts Collection",,,en,"This material may be protected under U. S. Copyright Law (Title 17, U.S. Code) which governs the making of photocopies or reproductions of copyrighted materials. You may use the digitized material for private study, scholarship, or research. Though the University of Alabama in Huntsville Archives and Special Collections has physical ownership of the material in its collections, in some cases we may not own the copyright to the material. It is the patron's obligation to determine and satisfy copyright restrictions when publishing or otherwise distributing materials found in our collections.",r06-211007,,,,,,,,,,,,,,,,,,,,,,,,,,,,,,,,,,,,,,,,,,,,,,,,,,,,,,,,,,,,,,,,,,,,,,,,,,,,,,,http://dkdayton.net/roberts/images/r06/pdfs/r06_01-11.pdf,"Still Image","Series 06: Pettus Family",1,0
14620,http://libarchstor2.uah.edu/digitalcollections/items/show/14620,"Alan Turing in 1951","Alan Turing in 1951",,"Alan Turing in 1951, at the time of his election to the Royal Society.","Elliot & Fry","National Portrait Gallery, London",1951-03-29,,,,"Alan Turing^^Royal Society",Photograph,"Bromide print","National Portrait Gallery, London","""Alan Turing: A Marginalized Icon in Early Computing"" by Jason Hatfield, HON 399 Research in London, Spring 2024",,,en,"© National Portrait Gallery, London. Used by permission.",,,,,,,,,,,,,,,,,,,,,,,,,,,,,,,,,,,,,,,,,,,,,,,,,,,,,,,,,,,,,,,,,,,,,,,,,,,,,,,"HON 399,Honors College,Student Projects,Study Abroad",http://libarchstor2.uah.edu/digitalcollections/files/original/204/14620/x27078.jpg,,"HON 399 Research in London",1,0
10402,http://libarchstor2.uah.edu/digitalcollections/items/show/10402,SkywritDec2068_032210104848.pdf^^spc_stnv_000808,"""Dec. 21 - 4:51 a.m. -One of great explorations of all time begins.""",,"News article detailing how Apollo 8 is ready for launch and the anticipation surrounding it.","Elliot, J. E.^^North American Rockwell Corporation",,1968-12-20,1960-1969,,,"Saturn project^^Periodicals^^Aerospace industries","Text^^News Articles",,"Saturn V Collection^^Box 29, Folder 39^^University of Alabama in Huntsville Archives, Special Collections, and Digital Initiatives, Huntsville, Alabama",,,,en,"This material may be protected under U. S. Copyright Law (Title 17, U.S. Code) which governs the making of photocopies or reproductions of copyrighted materials. You may use the digitized material for private study, scholarship, or research. Though the University of Alabama in Huntsville Archives and Special Collections has physical ownership of the material in its collections, in some cases we may not own the copyright to the material. It is the patron's obligation to determine and satisfy copyright restrictions when publishing or otherwise distributing materials found in our collections.",spc_stnv_000800_000824,,,,,,,,,,,,,,,,,,http://libarchstor.uah.edu:8081/repositories/2/archival_objects/18025,,,,,,,,,,,,,,,,,,,,,,,,,,,,,,,,,,,,,,,,,,,,,,,,,,,,,,,,,,,,,http://libarchstor2.uah.edu/digitalcollections/files/original/20/10402/SkywritDec2068_032210104848.pdf,,"Saturn V Collection",1,0
10399,http://libarchstor2.uah.edu/digitalcollections/items/show/10399,Skyrwritermay1669_121310160610.pdf^^spc_stnv_000805,"""All systems 'go' for liftoff  of Apollo 10.""",,"News article detailing that the final preparations for the lift-off of the Apollo rocket have been completed.","Elliott, J. S.^^North American Rockwell Corporation",,1969-05-16,1960-1969,,,"Saturn project^^Aerospace industries^^Periodicals","Text^^News Articles",,"Saturn V Collection^^Box 31, Folder 34^^University of Alabama in Huntsville Archives, Special Collections, and Digital Initiatives, Huntsville, Alabama",,,,en,"This material may be protected under U. S. Copyright Law (Title 17, U.S. Code) which governs the making of photocopies or reproductions of copyrighted materials. You may use the digitized material for private study, scholarship, or research. Though the University of Alabama in Huntsville Archives and Special Collections has physical ownership of the material in its collections, in some cases we may not own the copyright to the material. It is the patron's obligation to determine and satisfy copyright restrictions when publishing or otherwise distributing materials found in our collections.",spc_stnv_000800_000824,,,,,,,,,,,,,,,,,,http://libarchstor.uah.edu:8081/repositories/2/archival_objects/18117,,,,,,,,,,,,,,,,,,,,,,,,,,,,,,,,,,,,,,,,,,,,,,,,,,,,,,,,,,,,,http://libarchstor2.uah.edu/digitalcollections/files/original/20/10399/Skyrwritermay1669_121310160610.pdf,,"Saturn V Collection",1,0
10400,http://libarchstor2.uah.edu/digitalcollections/items/show/10400,skyspacdivvolxx_020410100926.pdf^^spc_stnv_000806,"""Moon brought near by Apollo 8 mission.""",,"News article detailing the recovery of the Apollo 8 crew after its successful mission.","Elliott, J. S.^^North American Rockwell Corporation",,1969-01-03,1960-1969,,,"Saturn project^^Periodicals^^Aerospace industries","Text^^News Articles",,"Saturn V Collection^^Box 30, Folder 10^^University of Alabama in Huntsville Archives, Special Collections, and Digital Initiatives, Huntsville, Alabama",,,,en,"This material may be protected under U. S. Copyright Law (Title 17, U.S. Code) which governs the making of photocopies or reproductions of copyrighted materials. You may use the digitized material for private study, scholarship, or research. Though the University of Alabama in Huntsville Archives and Special Collections has physical ownership of the material in its collections, in some cases we may not own the copyright to the material. It is the patron's obligation to determine and satisfy copyright restrictions when publishing or otherwise distributing materials found in our collections.",spc_stnv_000800_000824,,,,,,,,,,,,,,,,,,http://libarchstor.uah.edu:8081/repositories/2/archival_objects/18060,,,,,,,,,,,,,,,,,,,,,,,,,,,,,,,,,,,,,,,,,,,,,,,,,,,,,,,,,,,,,http://libarchstor2.uah.edu/digitalcollections/files/original/20/10400/skyspacdivvolxx_020410100926.pdf,,"Saturn V Collection",1,0
10401,http://libarchstor2.uah.edu/digitalcollections/items/show/10401,skyspadvicolxxix_020810134541.pdf^^spc_stnv_000807,"""Astronaut trio sees 'successful' Apollo 9 mission.""",,"News article detailing the hope from the Apollo 9 crew that their mission will be a success.","Elliott, J. S.^^North American Rockwell Corporation",,1969-01-31,1960-1969,,,"Saturn project^^Periodicals^^Aerospace industries^^Apollo project","Text^^News Articles",,"Saturn V Collection^^Box 30, Folder 17^^University of Alabama in Huntsville Archives, Special Collections, and Digital Initiatives, Huntsville, Alabama",,,,en,"This material may be protected under U. S. Copyright Law (Title 17, U.S. Code) which governs the making of photocopies or reproductions of copyrighted materials. You may use the digitized material for private study, scholarship, or research. Though the University of Alabama in Huntsville Archives and Special Collections has physical ownership of the material in its collections, in some cases we may not own the copyright to the material. It is the patron's obligation to determine and satisfy copyright restrictions when publishing or otherwise distributing materials found in our collections.",spc_stnv_000800_000824,,,,,,,,,,,,,,,,,,http://libarchstor.uah.edu:8081/repositories/2/archival_objects/18067,,,,,,,,,,,,,,,,,,,,,,,,,,,,,,,,,,,,,,,,,,,,,,,,,,,,,,,,,,,,,http://libarchstor2.uah.edu/digitalcollections/files/original/20/10401/skyspadvicolxxix_020810134541.pdf,,"Saturn V Collection",1,0
10403,http://libarchstor2.uah.edu/digitalcollections/items/show/10403,Skywritdec668_032210105145.pdf^^spc_stnv_000809,"""Countdown trials start for launch.""",,"News article detailing how the crew of the Apollo 8 are preparing for launch with a ""dry run.""","Elliott, J. S.^^North American Rockwell Corporation",,1968-12-06,1960-1969,,,"Saturn project^^Periodicals^^Aerospace industries","Text^^News Articles",,"Saturn V Collection^^Box 29, Folder 35^^University of Alabama in Huntsville Archives, Special Collections, and Digital Initiatives, Huntsville, Alabama",,,,en,"This material may be protected under U. S. Copyright Law (Title 17, U.S. Code) which governs the making of photocopies or reproductions of copyrighted materials. You may use the digitized material for private study, scholarship, or research. Though the University of Alabama in Huntsville Archives and Special Collections has physical ownership of the material in its collections, in some cases we may not own the copyright to the material. It is the patron's obligation to determine and satisfy copyright restrictions when publishing or otherwise distributing materials found in our collections.",spc_stnv_000800_000824,,,,,,,,,,,,,,,,,,http://libarchstor.uah.edu:8081/repositories/2/archival_objects/18021,,,,,,,,,,,,,,,,,,,,,,,,,,,,,,,,,,,,,,,,,,,,,,,,,,,,,,,,,,,,,http://libarchstor2.uah.edu/digitalcollections/files/original/20/10403/Skywritdec668_032210105145.pdf,,"Saturn V Collection",1,0
10404,http://libarchstor2.uah.edu/digitalcollections/items/show/10404,skywriterjan10_020910082855.pdf^^spc_stnv_000810,"""Five manned Apollo flights scheduled this year.""",,"News article detailing the planning of five more projects after the successful mission of Apollo 8.","Elliott, J. S.^^North American Rockwell Corporation",,1969-10-01,1960-1969,,,"Saturn project^^Periodicals^^Aerospace industries^^Apollo project","Text^^News Articles",,"Saturn V Collection^^Box 30, Folder 11^^University of Alabama in Huntsville Archives, Special Collections, and Digital Initiatives, Huntsville, Alabama",,,,en,"This material may be protected under U. S. Copyright Law (Title 17, U.S. Code) which governs the making of photocopies or reproductions of copyrighted materials. You may use the digitized material for private study, scholarship, or research. Though the University of Alabama in Huntsville Archives and Special Collections has physical ownership of the material in its collections, in some cases we may not own the copyright to the material. It is the patron's obligation to determine and satisfy copyright restrictions when publishing or otherwise distributing materials found in our collections.",spc_stnv_000800_000824,,,,,,,,,,,,,,,,,,http://libarchstor.uah.edu:8081/repositories/2/archival_objects/18061,,,,,,,,,,,,,,,,,,,,,,,,,,,,,,,,,,,,,,,,,,,,,,,,,,,,,,,,,,,,,http://libarchstor2.uah.edu/digitalcollections/files/original/20/10404/skywriterjan10_020910082855.pdf,,"Saturn V Collection",1,0
10405,http://libarchstor2.uah.edu/digitalcollections/items/show/10405,Skywriterjun1369_121410150031.pdf^^spc_stnv_000811,"""July 16th confirmed as definite for Apollo 11.""",,"News article covering NASA's announcement of Apollo 11's launch-date: July 16th.","Elliott, J. S.^^North American Rockwell Corporation",,1969-06-13,1960-1969,,,"Saturn project^^Periodicals^^Aerospace industries^^Apollo project","Text^^News Articles",,"Saturn V Collection^^Box 32, Folder 4^^University of Alabama in Huntsville Archives, Special Collections, and Digital Initiatives, Huntsville, Alabama",,,,en,"This material may be protected under U. S. Copyright Law (Title 17, U.S. Code) which governs the making of photocopies or reproductions of copyrighted materials. You may use the digitized material for private study, scholarship, or research. Though the University of Alabama in Huntsville Archives and Special Collections has physical ownership of the material in its collections, in some cases we may not own the copyright to the material. It is the patron's obligation to determine and satisfy copyright restrictions when publishing or otherwise distributing materials found in our collections.",spc_stnv_000800_000824,,,,,,,,,,,,,,,,,,http://libarchstor.uah.edu:8081/repositories/2/archival_objects/18183,,,,,,,,,,,,,,,,,,,,,,,,,,,,,,,,,,,,,,,,,,,,,,,,,,,,,,,,,,,,,http://libarchstor2.uah.edu/digitalcollections/files/original/20/10405/Skywriterjun1369_121410150031.pdf,,"Saturn V Collection",1,0
10406,http://libarchstor2.uah.edu/digitalcollections/items/show/10406,Skywriterjun669_121410150523.pdf^^spc_stnv_000812,"""July 16th still set as Apollo 11's 'L-Day.'""",,"News article confirming NASA's announcement of Apollo 11's launch-day. Focuses on the optimism surrounding the launch as well.","Elliott, J. S.^^North American Rockwell Corporation",,1969-06-06,1960-1969,,,"Saturn project^^Periodicals^^Aerospace industries^^Apollo project","Text^^News Articles",,"Saturn V Collection^^Box 31, Folder 47^^University of Alabama in Huntsville Archives, Special Collections, and Digital Initiatives, Huntsville, Alabama",,,,en,"This material may be protected under U. S. Copyright Law (Title 17, U.S. Code) which governs the making of photocopies or reproductions of copyrighted materials. You may use the digitized material for private study, scholarship, or research. Though the University of Alabama in Huntsville Archives and Special Collections has physical ownership of the material in its collections, in some cases we may not own the copyright to the material. It is the patron's obligation to determine and satisfy copyright restrictions when publishing or otherwise distributing materials found in our collections.",spc_stnv_000800_000824,,,,,,,,,,,,,,,,,,http://libarchstor.uah.edu:8081/repositories/2/archival_objects/18130,,,,,,,,,,,,,,,,,,,,,,,,,,,,,,,,,,,,,,,,,,,,,,,,,,,,,,,,,,,,,http://libarchstor2.uah.edu/digitalcollections/files/original/20/10406/Skywriterjun669_121410150523.pdf,,"Saturn V Collection",1,0